{"text_format":"1","workbook":"xlsx","n_sheets":10,"sheets":["Introduktion","1.1. Nulägesanalys","1.2. Resultat av nulägesanalys","2.1. Viktiga utmaningar","2.2. Möjliga insatser","2.3. Sammanställning","steg 2 - data","clear2","Variabler","clearnulageinmatning"],"not_rendered":{"charts":0,"images":6,"macros":1,"external_links":0,"defined_names":10,"comments":0,"pivot_tables":0},"unopened":[],"bounds":{"document_bytes":16777216,"sheet_cells":100000,"rows_first":2000,"rows_last":500,"rows_between":2000,"halvings":0,"cell_chars":16384,"cell_head_chars":4096},"cells_cut":0,"cells_raw":0,"read":"whole","date_system":"1900"}

{"sheet":"Introduktion","index":0,"n_rows":31,"n_cols":5,"rows_kept":31,"cut":false,"hidden":false,"merged":[[27,1,27,2],[28,1,28,2],[29,1,29,2],[30,1,30,2],[3,1,5,4],[18,1,19,1],[20,1,22,1],[25,1,25,2],[26,1,26,2],[14,1,14,4],[8,1,9,4],[10,1,10,4],[11,1,11,4]]}
[]
[]
[null,"Introduktion till detta verktyg"]
[null,"Denna fil, Verktyg för stärkt patientsäkerhet inom kunskapsstyrning, är utvecklad av Nationell samverkansgrupp för patientsäkerhet (NSG patientsäkerhet) i samverkan med Sveriges Kommuner och Regioner (SKR). Syftet är att stödja de nationella programområdena (NPO) i deras kunskapsstyrning för ökad patientsäkerhet, i enlighet med den nationella handlingsplanen för ökad patientsäkerhet. Verktyget innehåller ett stöd för nulägesanalys av patientsäkerhetsarbetet inom programområdet samt för att identifiera och prioritera bland möjliga insatser för att möta utmaningarna och därmed stärka kunskapsstyrningen för patientsäkerhet inom programområdet på lång sikt. \n\nVerktyget är ett stöd i två delar: \n- Del 1. Stöd för att genomföra en nulägesanalys av patientsäkerhetsarbetet inom ert programområde\n- Del 2. Stöd för att sortera och prioritera bland möjliga insatser för att möta utmaningarna\n\nNotera följande avseende funktionaliteten i verktyget: \n- För full funktionalitet i verktyget är det viktigt att använda knapparna under respektive flik för att ta er mellan flikarna. Detta säkerställer att all information följer med till nästa sida.\n- Det kan ta några sekunder för Excelfilen att ladda när ni klickar er vidare mellan de olika stegen, detta är helt normalt och beror på att information bearbetas från de olika flikarna.\n\nHur kan jag spara/rensa svar?\nOm ni laddar ner filen på er dator och klickar på \"spara\" innan ni stänger ner Excel, kan ni öppna upp filen vid senare tillfälle och fortsätta där ni lämnade. För att nollställa hela verktyget finns en knapp längst ned på denna sida. Notera att allt ni fyllt i kommer att raderas om ni väljer att klicka på denna knapp. Om ni enbart vill nollställa det ni fyllt i under en viss flik, går detta att göra under varje enskild flik. \n"]
[]
[]
[]
[null,"Använd det tillhörande genomförandestödet"]
[null,"Till verktyget finns ett genomförandestöd i två delar. I del 1 beskrivs hur verktyget är avsett att användas och viktiga begrepp och koncept förklaras. I del 2 beskrivs de fokusområden, förutsättningar och patientsäkerhetsteman som bygger upp nulägesanalysen. Det är rekommenderat att ta stöd i genomförandestödet såväl under förberedelser som genomförandet. Underlaget kan hittas via kunskapsstyrningsorganisationens webbsida, länk nedan.\n\n"]
[]
{"$rows_left_out":22}
{"sheet":"1.1. Nulägesanalys","index":1,"n_rows":309,"n_cols":9,"rows_kept":309,"cut":false,"hidden":false,"merged":[[8,7,20,8],[55,7,62,8],[2,1,2,4],[4,1,4,4],[1,2,1,4],[6,1,6,4],[3,1,3,4],[5,1,5,4],[13,2,13,4]]}
[]
[null," ","Kort instruktion: I denna flik genomför ni er nulägesanalys. Ange först bakgrundsinformation. Tryck på cellen nedan för att välja inom vilket NPO analysen utförs. I fälten under fyller ni i vilka aktörer/personer som deltagit i genomförandet samt vilka delar av NPO som omfattas av svaren i nulägesanalysen (exempelvis hela NPO, ett RPO eller en NAG). I del 1 av genomförandestödet finns exempel på hur det går att organisera arbetet med verktyget."]
[null,"Välj NPO från listan"]
[null,"Nulägesanalys genomförd av:"]
[null,null,null,null,null,null,null,"A-C-frågor besvarade",{"$f":"COUNTIF($D$20:$D$315,\">\"\"\")","v":0}]
[null,"Nulägesanalysen avser:"]
[null,null,null,null,null,null,null,"A-C-frågor som återstår att besvara",{"$f":"66-I5","v":66}]
[]
[null,null,"Grundläggande förutsättningar för patientsäkerhetsarbete",null,null,null,null,"Forts. instruktion \nEfter att ni fyllt i bakgrundsinformationen överst på sidan, påbörja nulägesanalysen:\n1. Besvara frågorna A-C för temat (genom att klicka två gånger på svarsfältet för att se svarsalternativen)\n2. Beskriv i fritextfältet under fråga D en kortfattad förklaring av ert resonemang kring svaren i frågorna A-C  \n3. Gå vidare till nästa tema\n4. När hela nulägesanalysen genomförts, gå vidare till resultatet. OBS. Använd knappen \"Visa resultat av nulägesanalys\" för att gå vidare \n\nLästips i genomförandestödet:\n- Del 1, instruktioner och tips på s. 11\n- Del 2, beskrivningar av teman "]
[]
{"$rows_left_out":300}
{"sheet":"1.2. Resultat av nulägesanalys","index":2,"n_rows":35,"n_cols":8,"rows_kept":35,"cut":false,"hidden":false,"merged":[[10,7,14,9],[9,8,9,9],[5,1,5,5],[2,1,2,5],[1,1,1,5],[3,1,3,5],[7,8,7,9],[8,8,8,9]]}
[]
[null,{"$f":"\"Resultat av nulägesanalys, \"&'1.1. Nulägesanalys'!B3:E3&\"\"","v":"Resultat av nulägesanalys, Välj NPO från listan"}]
[null,{"$f":"\"\"&'1.1. Nulägesanalys'!B5:E5&\"\"","v":""}]
[null,{"$f":"\"\"&'1.1. Nulägesanalys'!B7:E7&\"\"","v":""}]
[]
[null,"Information: Nedan visas resultatet av genomförd nulägesanalys. Om ni vill justera/uppdatera analysen, gå tillbaka till föregående sida i verktyget (flik 1.1). Om delar av beskrivningen av utmaningar, hinder och möjliggörare är dold går det bra att bredda raderna genom att i vänstermarginalen (se pil) dubbelklicka på strecket mellan raderna. OBS. Använd knappen högst upp till höger för att gå vidare till nästa steg.\nLästips i genomförandestödet: s. 14"]
[]
[null,"Grundläggande förutsättningar för patientsäkerhetsarbete","A. Tillräcklig kunskap?","B. Tillräckliga stöd?","C. Används kunskap och stöd?","D. Beskrivning av utmaningar eller var det saknas information om nuläget"]
[null,{"$f":"'1.1. Nulägesanalys'!C18","v":"En god säkerhetskultur"},{"$f":"IFERROR(VLOOKUP('1.1. Nulägesanalys'!D20,Variabler!$D$3:$E$7,2,FALSE),\"\")","v":""},{"$f":"IFERROR(VLOOKUP('1.1. Nulägesanalys'!D22,Variabler!$D$3:$E$7,2,FALSE),\"\")","v":""},{"$f":"IFERROR(VLOOKUP('1.1. Nulägesanalys'!D24,Variabler!$D$3:$E$7,2,FALSE),\"\")","v":""},{"$f":"IF('1.1. Nulägesanalys'!C27>\"\",'1.1. Nulägesanalys'!C27,\"\")","v":""}]
[null,{"$f":"'1.1. Nulägesanalys'!C31","v":"Adekvat kunskap och kompetens"},{"$f":"IFERROR(VLOOKUP('1.1. Nulägesanalys'!D33,Variabler!$D$3:$E$7,2,FALSE),\"\")","v":""},{"$f":"IFERROR(VLOOKUP('1.1. Nulägesanalys'!D35,Variabler!$D$3:$E$7,2,FALSE),\"\")","v":""},{"$f":"IFERROR(VLOOKUP('1.1. Nulägesanalys'!D37,Variabler!$D$3:$E$7,2,FALSE),\"\")","v":""},{"$f":"IF('1.1. Nulägesanalys'!C40>\"\",'1.1. Nulägesanalys'!C40,\"\")","v":""}]
{"$rows_left_out":26}
{"sheet":"2.1. Viktiga utmaningar","index":3,"n_rows":33,"n_cols":9,"rows_kept":33,"cut":false,"hidden":false,"merged":[[1,1,1,6],[2,1,2,6],[3,1,3,6],[5,8,12,9]]}
[]
[null,{"$f":"\"Prioritering av utmaningar, \"&'1.1. Nulägesanalys'!B3:E3&\"\"","v":"Prioritering av utmaningar, Välj NPO från listan"}]
[null,{"$f":"\"\"&'1.1. Nulägesanalys'!B5:E5&\"\"","v":""}]
[null,{"$f":"\"\"&'1.1. Nulägesanalys'!B7:E7&\"\"","v":""}]
[]
[null,"Fokusområde 1: Öka kunskap om inträffade vårdskador","Finns kunskap?","Finns stöd?","Används kunskap och stöd?","D. Beskrivning av utmaningar eller var det saknas information om nuläget","Välj prioriterade teman:",null,"Kort instruktion:\nPå denna sida markerar ni teman som är prioriterade att ta fram insatser för:\n1. I kolumn G: Välj \"Prioritera\" för de teman som ni bedömer som proriterade att ta fram insatser för \n2. Om ni vill kan ni även beskriva de teman ni vill avvakta med, där ni redan genomför arbeten eller där temat är under kontroll (detta är inte nödvändigt för att gå vidare) \n3. Klicka på knappen \"Gå vidare till nästa steg\"\n\nOm delar av beskrivningen av utmaningar, hinder och möjliggörare är dold går det bra att bredda raderna genom att i vänstermarginalen dubbelklicka på strecket mellan raderna.\n\nLästips i genomförandestödet: del 1, s. 16"]
[null,{"$f":"'1.1. Nulägesanalys'!C18","v":"En god säkerhetskultur"},{"$f":"IFERROR(VLOOKUP('1.1. Nulägesanalys'!D20,Variabler!$D$3:$E$7,2,FALSE),\"\")","v":""},{"$f":"IFERROR(VLOOKUP('1.1. Nulägesanalys'!D22,Variabler!$D$3:$E$7,2,FALSE),\"\")","v":""},{"$f":"IFERROR(VLOOKUP('1.1. Nulägesanalys'!D24,Variabler!$D$3:$E$7,2,FALSE),\"\")","v":""},{"$f":"IF('1.1. Nulägesanalys'!C27>\"\",'1.1. Nulägesanalys'!C27,\"\")","v":""}]
[null,{"$f":"'1.1. Nulägesanalys'!C31","v":"Adekvat kunskap och kompetens"},{"$f":"IFERROR(VLOOKUP('1.1. Nulägesanalys'!D33,Variabler!$D$3:$E$7,2,FALSE),\"\")","v":""},{"$f":"IFERROR(VLOOKUP('1.1. Nulägesanalys'!D35,Variabler!$D$3:$E$7,2,FALSE),\"\")","v":""},{"$f":"IFERROR(VLOOKUP('1.1. Nulägesanalys'!D37,Variabler!$D$3:$E$7,2,FALSE),\"\")","v":""},{"$f":"IF('1.1. Nulägesanalys'!C40>\"\",'1.1. Nulägesanalys'!C40,\"\")","v":""}]
[null,{"$f":"'1.1. Nulägesanalys'!C44","v":"Patienten som medskapare"},{"$f":"IFERROR(VLOOKUP('1.1. Nulägesanalys'!D46,Variabler!$D$3:$E$7,2,FALSE),\"\")","v":""},{"$f":"IFERROR(VLOOKUP('1.1. Nulägesanalys'!D48,Variabler!$D$3:$E$7,2,FALSE),\"\")","v":""},{"$f":"IFERROR(VLOOKUP('1.1. Nulägesanalys'!D50,Variabler!$D$3:$E$7,2,FALSE),\"\")","v":""},{"$f":"IF('1.1. Nulägesanalys'!C53>\"\",'1.1. Nulägesanalys'!C53,\"\")","v":""}]
[null,{"$f":"'1.1. Nulägesanalys'!C57","v":"Patienter och närståendes erfarenheter av vårdskador"},{"$f":"IFERROR(VLOOKUP('1.1. Nulägesanalys'!D59,Variabler!$D$3:$E$7,2,FALSE),\"\")","v":""},{"$f":"IFERROR(VLOOKUP('1.1. Nulägesanalys'!D61,Variabler!$D$3:$E$7,2,FALSE),\"\")","v":""},{"$f":"IFERROR(VLOOKUP('1.1. Nulägesanalys'!D63,Variabler!$D$3:$E$7,2,FALSE),\"\")","v":""},{"$f":"IF('1.1. Nulägesanalys'!C66>\"\",'1.1. Nulägesanalys'!C66,\"\")","v":""}]
{"$rows_left_out":24}
{"sheet":"2.2. Möjliga insatser","index":4,"n_rows":67,"n_cols":34,"rows_kept":67,"cut":false,"hidden":false,"merged":[[1,1,1,3],[2,1,2,3],[3,1,3,3],[5,1,7,3],[10,10,16,10]]}
[]
[null,{"$f":"\"Handlingsalternativ, \"&'1.1. Nulägesanalys'!B3:E3&\"\"","v":"Handlingsalternativ, Välj NPO från listan"},null,null,null,"Prioriterade teman","Prioriterade teman med minst en insats beskriven"]
[null,{"$f":"\"\"&'1.1. Nulägesanalys'!B5:E5&\"\"","v":""},null,null,"Grundläggande förutsättningar",{"$f":"COUNTIF(V11:V19,\">\"\"\")","v":0},{"$f":"COUNTIF(AC11:AC19,\">0\")","v":0},null,null,null,null,null,"Fokusområde 1: Öka kunskap om inträffade vårdskador"]
[null,{"$f":"\"\"&'1.1. Nulägesanalys'!B7:E7&\"\"","v":""},null,null,"Fokusområde 1",{"$f":"COUNTIF(W11:W19,\">\"\"\")","v":0},{"$f":"COUNTIF(AD11:AD19,\">0\")","v":0},null,null,null,null,null,"Fokusområde 2: Tillförlitliga och säkra system och processer "]
[null,null,null,null,"Fokusområde 2",{"$f":"COUNTIF(X11:X19,\">\"\"\")","v":0},{"$f":"COUNTIF(AE11:AE19,\">0\")","v":0},null,null,null,null,null,"Fokusområde 3: Säker vård här och nu"]
[null,"Kort instruktion: På denna sida beskriver ni insatser för era prioriterade teman och uppskattar resursåtgång och förväntad effekt\n1. Välj område i kolumnen nedan (OBS. enbart områden med teman som ni i föregående steg valt att prioritera går att välja)\n2. Välj det tema inom området som du vill beskriva en insats för (enbart era prioriterade teman går att välja)\n3. Beskriv insatser och aktörer i de grå fritextfälten för ett tema i taget. Det går att välja samma tema flera gånger. \n4. Om aktören är annan än ert NPO, beskriv då vilka kontakter ni bör ta (vem ska kontaktas, hur och av vem?)\n5. När ni beskrivit insatser för samtliga prioriterade teman - bedöm resursåtgången av att genomföra respektive insats samt den förväntade effekten på patientsäkerheten, gå sedan vidare till sammanställningen. Om aktören som bör agera är en annan än ert NPO, ange \"Annan aktör bedömer\" i båda dessa kolumner. Lästips i genomförandestödet: del 1, s. 18 samt del 2, kapitel 3. ",null,null,"Fokusområde 3",{"$f":"COUNTIF(Y11:Y19,\">\"\"\")","v":0},{"$f":"COUNTIF(AF11:AF19,\">0\")","v":0},null,null,null,null,null,"Fokusområde 4: Stärka analys, lärande och utveckling"]
[null,null,null,null,"Fokusområde 4",{"$f":"COUNTIF(Z11:Z19,\">\"\"\")","v":0},{"$f":"COUNTIF(AG11:AG19,\">0\")","v":0},null,null,null,null,null,"Fokusområde 5: Öka riskmedvetenhet och beredskap"]
[null,null,null,null,"Fokusområde 5",{"$f":"COUNTIF(AA11:AA19,\">\"\"\")","v":0},{"$f":"COUNTIF(AH11:AH19,\">0\")","v":0},null,null,null,null,null,null,null,null,null,null,null,null,null,null,null,null,null,null,null,null,null,"Ifyllda"]
[null,null,null,null,null,null,null,null,null,null,null,null,null,"Antal fokusområden",null,{"$f":"COUNTIF($T$11:$T$24,\">\"\"\")","v":0},null,null,null,null,null,"Grundläggande förutsättningar för patientsäkerhetsarbete","Fokusområde 1: Öka kunskap om inträffade vårdskador","Fokusområde 2: Tillförlitliga och säkra system och processer ","Fokusområde 3: Säker vård här och nu","Fokusområde 4: Stärka analys, lärande och utveckling","Fokusområde 5: Öka riskmedvetenhet och beredskap",null,"Grundläggande förutsättningar för patientsäkerhetsarbete","Fokusområde 1: Öka kunskap om inträffade vårdskador","Fokusområde 2: Tillförlitliga och säkra system och processer ","Fokusområde 3: Säker vård här och nu","Fokusområde 4: Stärka analys, lärande och utveckling","Fokusområde 5: Öka riskmedvetenhet och beredskap"]
[null,"Välj område","Välj tema","Beskriv insatser för att möta de identifierade utmaningarna","Beskriv vilken/vilka aktörer som bör agera","Om annan aktör än NPO, vilka kontakter bör NPO ta?","Uppskattad resursåtgång","Förväntad effekt","Prio-värde",null,null,null,null,"Aktuell lista","Listkolumn","Aktuell listlängd",null,null,null,"Fokusområden","Aktuell lista",1,2,3,4,5,6,null,1,2,3,4,5,6]
{"$rows_left_out":58}
{"sheet":"2.3. Sammanställning","index":5,"n_rows":6,"n_cols":11,"rows_kept":6,"cut":false,"hidden":false,"merged":[[1,1,1,8],[2,1,2,8],[3,1,3,8],[5,10,20,13]]}
[]
[null,{"$f":"\"Prioritering av utmaningar, \"&'1.1. Nulägesanalys'!B3:E3&\"\"","v":"Prioritering av utmaningar, Välj NPO från listan"}]
[null,{"$f":"\"\"&'1.1. Nulägesanalys'!B5:E5&\"\"","v":""}]
[null,{"$f":"\"\"&'1.1. Nulägesanalys'!B7:E7&\"\"","v":""}]
[null,"Område"]
[null,"Område","Tema","Insats","Aktör","Kontakt","Uppskattad resursåtgång","Förväntad effekt","Prio-värde",null,"Information: På denna sida genereras en sammanställning över de insatser ni beskrivit i föregående steg. Använd pilknapparna för att filtrera ut insatser, ex. inom ett visst tema eller för att sortera om insatserna, ex. utifrån lägst resursåtgång/störst effekt. Om viss text är dold, bredda raderna genom att i vänstermarginalen dubbelklicka på strecket mellan raderna.\n\nOBS! Om ni vill ändra formuleringen av insatser/aktör eller bedömning av priovärde, gör uppdateringarna på föregående sida (flik 2.2). Denna sida bör endast användas för att filtrera och sortera i resultatet.\n\nLästips i genomförandestödet: del 1, s. 24"]

{"sheet":"steg 2 - data","index":6,"n_rows":44,"n_cols":15,"rows_kept":44,"cut":false,"hidden":true,"merged":[]}
[]
["Antal val",{"$f":"COUNTIF(B5:B19,\">\"\"\")","v":0},null,null,{"$f":"COUNTIF(E5:E19,\">\"\"\")","v":0},null,{"$f":"COUNTIF(G5:G19,\">\"\"\")","v":0},null,{"$f":"COUNTIF(I5:I19,\">\"\"\")","v":0},null,{"$f":"COUNTIF(K5:K19,\">\"\"\")","v":0},null,{"$f":"COUNTIF(M5:M19,\">\"\"\")","v":0},null,{"$f":"COUNTIF(O5:O19,\">\"\"\")","v":0}]
[null,null,null,null,"Grundläggande förutsättningar för patientsäkerhetsarbete",null,"Fokusområde 1: Öka kunskap om inträffade vårdskador",null,"Fokusområde 2: Tillförlitliga och säkra system och processer ",null,"Fokusområde 3: Säker vård här och nu",null,"Fokusområde 4: Stärka analys, lärande och utveckling",null,"Fokusområde 5: Öka riskmedvetenhet och beredskap"]
[null,"Fokusområden","Aktuell lista",null,1,null,2,null,3,null,4,null,5,null,6]
[null,{"$f":"IFERROR(INDEX(B$22:B$33,MATCH(ROW()-ROW($Q$4),A$22:A$33,0)),\"\")","v":""},null,null,{"$f":"IFERROR(INDEX(E$22:E$33,MATCH(ROW()-ROW($Q$4),D$22:D$33,0)),\"\")","v":""},null,{"$f":"IFERROR(INDEX(G$22:G$33,MATCH(ROW()-ROW($Q$4),F$22:F$33,0)),\"\")","v":""},null,{"$f":"IFERROR(INDEX(I$22:I$33,MATCH(ROW()-ROW($Q$4),H$22:H$33,0)),\"\")","v":""},null,{"$f":"IFERROR(INDEX(K$22:K$33,MATCH(ROW()-ROW($Q$4),J$22:J$33,0)),\"\")","v":""},null,{"$f":"IFERROR(INDEX(M$22:M$33,MATCH(ROW()-ROW($Q$4),L$22:L$33,0)),\"\")","v":""},null,{"$f":"IFERROR(INDEX(O$22:O$33,MATCH(ROW()-ROW($Q$4),N$22:N$33,0)),\"\")","v":""}]
[null,{"$f":"IFERROR(INDEX(B$22:B$33,MATCH(ROW()-ROW($Q$4),A$22:A$33,0)),\"\")","v":""},null,null,{"$f":"IFERROR(INDEX(E$22:E$33,MATCH(ROW()-ROW($Q$4),D$22:D$33,0)),\"\")","v":""},null,{"$f":"IFERROR(INDEX(G$22:G$33,MATCH(ROW()-ROW($Q$4),F$22:F$33,0)),\"\")","v":""},null,"",null,"",null,"",null,""]
[null,"",null,null,"",null,"",null,"",null,"",null,"",null,""]
[null,"",null,null,"",null,"",null,"",null,"",null,"",null,""]
[null,"",null,null,"",null,"",null,"",null,"",null,"",null,""]
[null,"",null,null,"",null,"",null,"",null,"",null,"",null,""]
{"$rows_left_out":35}
{"sheet":"clear2","index":7,"n_rows":62,"n_cols":9,"rows_kept":62,"cut":false,"hidden":true,"merged":[[1,1,1,3],[2,1,2,3]]}
[]
[null,{"$f":"\"Handlingsalternativ, \"&'1.1. Nulägesanalys'!B3:E3&\"\"","v":"Handlingsalternativ, Välj NPO från listan"}]
[null,{"$f":"\"\"&'1.1. Nulägesanalys'!B5:E5&\"\"","v":""}]
[]
[null,"Välj område","Välj tema","Beskriv insatser för att möta de identifierade utmaningarna","Beskriv vilken/vilka aktörer som bör agera","Om annan aktör än NPO, vilka kontakter bör NPO ta?","Uppskattad resursåtgång","Förväntad effekt","Prio-värde"]
[null,null,null,null,null,null,null,null,{"$f":"IFERROR(IF(G6=\"Annan aktör bedömer\",0,VLOOKUP(G6,Variabler!$C$33:$D$36,2,FALSE)+VLOOKUP(H6,Variabler!$E$32:$F$36,2,FALSE)),\"\")","v":""}]
[null,null,null,null,null,null,null,null,{"$f":"IFERROR(IF(G7=\"Annan aktör bedömer\",0,VLOOKUP(G7,Variabler!$C$33:$D$36,2,FALSE)+VLOOKUP(H7,Variabler!$E$32:$F$36,2,FALSE)),\"\")","v":""}]
[null,null,null,null,null,null,null,null,{"$f":"IFERROR(IF(G8=\"Annan aktör bedömer\",0,VLOOKUP(G8,Variabler!$C$33:$D$36,2,FALSE)+VLOOKUP(H8,Variabler!$E$32:$F$36,2,FALSE)),\"\")","v":""}]
[null,null,null,null,null,null,null,null,{"$f":"IFERROR(IF(G9=\"Annan aktör bedömer\",0,VLOOKUP(G9,Variabler!$C$33:$D$36,2,FALSE)+VLOOKUP(H9,Variabler!$E$32:$F$36,2,FALSE)),\"\")","v":""}]
[null,null,null,null,null,null,null,null,{"$f":"IFERROR(IF(G10=\"Annan aktör bedömer\",0,VLOOKUP(G10,Variabler!$C$33:$D$36,2,FALSE)+VLOOKUP(H10,Variabler!$E$32:$F$36,2,FALSE)),\"\")","v":""}]
{"$rows_left_out":53}
{"sheet":"Variabler","index":8,"n_rows":40,"n_cols":9,"rows_kept":40,"cut":false,"hidden":true,"merged":[[0,16,0,21],[1,16,1,21]]}
[]
[null,null,null,"Alternativ","Värde",null,null,null,"Region"]
[null,null,null,"Ja",2,null,null,null,"Välj NPO från listan"]
[null,null,null,"Ja, i huvudsak ",1,null,null,null,"NPO Akut vård"]
[null,null,null,"Till viss del",-1,null,null,null,"NPO Barn och ungdomars hälsa"]
[null,null,null,"Nej",-2,null,null,null,"NPO Cancersjukdomar"]
[null,null,null,"Tillräcklig info saknas",0,null,null,null,"NPO Endokrina sjukdomar"]
[null,null,null,null,null,null,null,null,"NPO Hjärt- och kärlsjukdomar"]
[null,null,null,null,null,null,null,null,"NPO Hud- och kärlsjukdomar"]
[null,null,null,null,null,null,null,null,"NPO Infektionssjukdomar"]
{"$rows_left_out":31}
{"sheet":"clearnulageinmatning","index":9,"n_rows":309,"n_cols":9,"rows_kept":309,"cut":false,"hidden":true,"merged":[[11,7,26,8],[1,2,1,4],[2,1,2,4],[4,1,4,4],[6,1,6,4],[3,1,3,4],[5,1,5,4],[13,2,13,4]]}
[]
[null," ","Kort instruktion: I denna flik genomför ni er nulägesanalys. Ange först bakgrundsinformation. Tryck på cellen nedan för att välja inom vilket NPO analysen utförs. I fälten under fyller ni i vilka aktörer/personer som deltagit i genomförandet samt vilka delar av NPO som omfattas av svaren i nulägesanalysen (exempelvis hela NPO, ett RPO eller en NAG). I del 1 av genomförandestödet finns exempel på hur det går att organisera arbetet med verktyget."]
[null,"Välj NPO från listan"]
[null,"Nulägesanalys genomförd av:"]
[null,null,null,null,null,null,null,"A-C-frågor besvarade",{"$f":"COUNTIF($D$81:$D$1048576,\">\"\"\")","v":0}]
[null,"Nulägesanalysen avser:"]
[null,null,null,null,null,null,null,"A-C-frågor som återstår att besvara",{"$f":"99-I5","v":99}]
[]
[null,null,"Grundläggande förutsättningar för patientsäkerhetsarbete"]
[]
{"$rows_left_out":299}