{"text_format":"1","workbook":"xlsx","n_sheets":8,"sheets":["N data","N datadyn","S datadyn","Introduktion","Import","1.1 Sammanvägd nulägesanalys","1.2 Nulägesöversikt","2.1 Sammanställning"],"not_rendered":{"charts":0,"images":8,"macros":1,"external_links":0,"defined_names":4,"comments":0,"pivot_tables":0},"unopened":[],"bounds":{"document_bytes":16777216,"sheet_cells":100000,"rows_first":2000,"rows_last":500,"rows_between":2000,"halvings":0,"cell_chars":16384,"cell_head_chars":4096},"cells_cut":0,"cells_raw":0,"read":"whole","date_system":"1900"}

{"sheet":"N data","index":0,"n_rows":0,"n_cols":0,"rows_kept":0,"cut":false,"hidden":true,"merged":[]}

{"sheet":"N datadyn","index":1,"n_rows":133,"n_cols":59,"rows_kept":133,"cut":false,"hidden":true,"merged":[]}
[null,"Concatenate:"," ",{"$f":"LEN(B8)","v":23},null,"Hjälp 1",null,null,"Upprepning","Hjälp2",null,null,null,null,"Genomsnitt ja-nej","Summa","Antal ja-nej","Kvot info saknas","Antal info saknas","N1","N2","N3","N4","N5","N6","N7","N8","N9","N10","N11","N12","N13","N14","N15","N16","N17","N18","N19","N20","N21","N22","N23","N24","N25","N26","N27","N28","N29","N30","N31","N32","N33","N34","N35","N36","N37","N38","N39","N40"]
[null,{"$f":"CONCATENATE(D9,C1,D10,C1,D11,C1,D12,C1,D13,C1,D14,C1,D15,C1,D16,C1,D17,C1,D18,C1,D19,C1,D20,C1,D21,C1,D22,C1,D23,C1,D24,C1,D25,C1,D26,C1,D27,C1,D28,C1,D29,C1,D30,C1,D31,C1,D32,C1,D33,C1,D34,C1,D35,C1,D36,C1,D37,C1,D38,C1,D39,C1,D40,C1,D41,C1,D42,C1,D43,C1,D44,C1,D45,C1,D46,C1,D47,C1,D48)","v":"                                       "},null,null,null,1,1,"En god säkerhetskultur",4,1,{"$f":"VLOOKUP($J2,$F$2:$H$34,3,TRUE)","v":"En god säkerhetskultur"},"A. Tillräcklig kunskap?",{"$f":"VLOOKUP(L2,$H$43:$I$46,2,FALSE)","v":2},{"$f":"CONCATENATE(K2,L2)","v":"En god säkerhetskulturA. Tillräcklig kunskap?"},{"$f":"IFERROR(P2/Q2,\"\")","v":""},{"$f":"SUM(T2:BG2)","v":0},{"$f":"COUNT(IF(T2:BG2<>0,T2:BG2))","v":0},{"$f":"IFERROR(S2/(Q2+S2),\"\")","v":""},{"$f":"COUNTIF(T2:BG2,0)","v":0},{"$f":"IFERROR(VLOOKUP($K2, INDIRECT(\"'\"&T$1&\"'!$B$4:$F$46\"),$M2,FALSE),\"\")","v":""},{"$f":"IFERROR(VLOOKUP($K2, INDIRECT(\"'\"&U$1&\"'!$B$4:$F$46\"),$M2,FALSE),\"\")","v":""},"","","","","","","","","","","","","","","","","","","","","","","","","","","","","","","","","","","","","",""]
[null,null,null,null,null,{"$f":"F2+I2","v":5},2,"Adekvat kunskap och kompetens",4,2,{"$f":"VLOOKUP($J3,$F$2:$H$34,3,TRUE)","v":"En god säkerhetskultur"},"B. Tillräckliga stöd?",{"$f":"VLOOKUP(L3,$H$43:$I$46,2,FALSE)","v":3},{"$f":"CONCATENATE(K3,L3)","v":"En god säkerhetskulturB. Tillräckliga stöd?"},"",0,{"$f":"COUNT(IF(T3:BG3<>0,T3:BG3))","v":0},{"$f":"IFERROR(S3/(Q3+S3),\"\")","v":""},0,{"$f":"IFERROR(VLOOKUP($K3, INDIRECT(\"'\"&T$1&\"'!$B$4:$F$46\"),$M3,FALSE),\"\")","v":""},"","","","","","","","","","","","","","","","","","","","","","","","","","","","","","","","","","","","","","",""]
[null,null,null,null,null,9,3,"Patienten som medskapare",4,3,"En god säkerhetskultur","C. Används kunskap och stöd?",4,"En god säkerhetskulturC. Används kunskap och stöd?","",0,{"$f":"COUNT(IF(T4:BG4<>0,T4:BG4))","v":0},"",0,"","","","","","","","","","","","","","","","","","","","","","","","","","","","","","","","","","","","","","","",""]
[null,null,null,null,null,13,4,"Patienter och närståendes erfarenheter av vårdskador",4,4,"En god säkerhetskultur","D. Beskrivning av utmaningar, hinder och möjliggörare",5,"En god säkerhetskulturD. Beskrivning av utmaningar, hinder och möjliggörare","",0,{"$f":"COUNT(IF(T5:BG5<>0,T5:BG5))","v":0},"",0,"","","","","","","","","","","","","","","","","","","","","","","","","","","","","","","","","","","","","","","",""]
[null,null,null,null,null,17,5,"Patientmedverkan i utveckling av processer och arbetssätt",4,5,"Adekvat kunskap och kompetens","A. Tillräcklig kunskap?",2,"Adekvat kunskap och kompetensA. Tillräcklig kunskap?","",0,{"$f":"COUNT(IF(T6:BG6<>0,T6:BG6))","v":0},"",0,"","","","","","","","","","","","","","","","","","","","","","","","","","","","","","","","","","","","","","","",""]
[null,null,null,null,null,21,6,"Patientens delaktighet i den egna vården",4,6,"Adekvat kunskap och kompetens","B. Tillräckliga stöd?",3,"Adekvat kunskap och kompetensB. Tillräckliga stöd?","",0,{"$f":"COUNT(IF(T7:BG7<>0,T7:BG7))","v":0},"",0,"","","","","","","","","","","","","","","","","","","","","","","","","","","","","","","","","","","","","","","",""]
[null,"Nulägesanalysen avser: ","fliknamn","Förkortat namn:",null,25,7,"Patientmedverkan för ökad riskmedvetenhet och beredskap",4,7,"Adekvat kunskap och kompetens","C. Används kunskap och stöd?",4,"Adekvat kunskap och kompetensC. Används kunskap och stöd?","",0,{"$f":"COUNT(IF(T8:BG8<>0,T8:BG8))","v":0},"",0,"","","","","","","","","","","","","","","","","","","","","","","","","","","","","","","","","","","","","",{"$f":"IFERROR(VLOOKUP($K8, INDIRECT(\"'\"&BE$1&\"'!$B$4:$F$46\"),$M8,FALSE),\"\")","v":""},"",""]
[null,{"$f":"IFERROR( INDIRECT(\"'\"&$C9&\"'!$B$4\"), \"\")","v":""},"N1",{"$f":"B9","v":""},null,29,8,"Identifiering, sammanställning och aggregering av information om vårdskador",4,8,"Adekvat kunskap och kompetens","D. Beskrivning av utmaningar, hinder och möjliggörare",5,"Adekvat kunskap och kompetensD. Beskrivning av utmaningar, hinder och möjliggörare","",0,{"$f":"COUNT(IF(T9:BG9<>0,T9:BG9))","v":0},"",0,"","","","","","","","","","","","","","","","","","","","","","","","","","","","","","","","","","","","","","","",""]
[null,{"$f":"IFERROR( INDIRECT(\"'\"&$C10&\"'!$B$4\"), \"\")","v":""},"N2",{"$f":"B10","v":""},null,33,9,"Minimering av effekter av negativa händelser",4,9,"Patienten som medskapare","A. Tillräcklig kunskap?",2,"Patienten som medskapareA. Tillräcklig kunskap?","",0,{"$f":"COUNT(IF(T10:BG10<>0,T10:BG10))","v":0},"",0,"","","","","","","","","","","","","","","","","","","","","","","","","","","","","","","","","","","","","","","",""]
[null,{"$f":"IFERROR( INDIRECT(\"'\"&$C11&\"'!$B$4\"), \"\")","v":""},"N3","",null,37,10,"Tillförlitliga och säkra vårdprocesser och rutiner som omfattar patientens väg i hälso- och sjukvården",4,10,"Patienten som medskapare","B. Tillräckliga stöd?",3,"Patienten som medskapareB. Tillräckliga stöd?","",0,{"$f":"COUNT(IF(T11:BG11<>0,T11:BG11))","v":0},"",0,"","","","","","","","","","","","","","","","","","","","","","","","","","","","","","","","","","","","","","","",""]
[null,{"$f":"IFERROR( INDIRECT(\"'\"&$C12&\"'!$B$4\"), \"\")","v":""},"N4","",null,41,11,"Kunskapsbaserade verktyg, metoder och arbetssätt för ett patientsäkert arbete",4,11,"Patienten som medskapare","C. Används kunskap och stöd?",4,"Patienten som medskapareC. Används kunskap och stöd?","",0,{"$f":"COUNT(IF(T12:BG12<>0,T12:BG12))","v":0},"",0,"","","","","","","","","","","","","","","","","","","","","","","","","","","","","","","","","","","","","","","",""]
[null,{"$f":"IFERROR( INDIRECT(\"'\"&$C13&\"'!$B$4\"), \"\")","v":""},"N5","",null,45,12,"Medicinteknik, medicintekniska produkter, hjälpmedel och välfärdsteknik",4,12,"Patienten som medskapare","D. Beskrivning av utmaningar, hinder och möjliggörare",5,"Patienten som medskapareD. Beskrivning av utmaningar, hinder och möjliggörare","",0,{"$f":"COUNT(IF(T13:BG13<>0,T13:BG13))","v":0},"",0,"","","","","","","","","","","","","","","","","","","","","","","","","","","","","","","","","","","","","","","",""]
[null,{"$f":"IFERROR( INDIRECT(\"'\"&$C14&\"'!$B$4\"), \"\")","v":""},"N6","",null,49,13,"Förmåga att förutse variationer och störningar i närtid",4,13,"Patienter och närståendes erfarenheter av vårdskador","A. Tillräcklig kunskap?",2,"Patienter och närståendes erfarenheter av vårdskadorA. Tillräcklig kunskap?","",0,{"$f":"COUNT(IF(T14:BG14<>0,T14:BG14))","v":0},"",0,"","","","","","","","","","","","","","","","","","","","","","","","","","","","","","","","","","","","","","","",""]
[null,{"$f":"IFERROR( INDIRECT(\"'\"&$C15&\"'!$B$4\"), \"\")","v":""},"N7","",null,53,14,"Situationsanpassning",4,14,"Patienter och närståendes erfarenheter av vårdskador","B. Tillräckliga stöd?",3,"Patienter och närståendes erfarenheter av vårdskadorB. Tillräckliga stöd?","",0,{"$f":"COUNT(IF(T15:BG15<>0,T15:BG15))","v":0},"",0,"","","","","","","","","","","","","","","","","","","",{"$f":"IFERROR(VLOOKUP($K15, INDIRECT(\"'\"&AM$1&\"'!$B$4:$F$46\"),$M15,FALSE),\"\")","v":""},"","","","","","","","","","","","","","","","","","","",""]
[null,{"$f":"IFERROR( INDIRECT(\"'\"&$C16&\"'!$B$4\"), \"\")","v":""},"N8","",null,57,15,"Uppföljning av patientsäkerheten genom insamling och sammanställnig av data från flera källor",4,15,"Patienter och närståendes erfarenheter av vårdskador","C. Används kunskap och stöd?",4,"Patienter och närståendes erfarenheter av vårdskadorC. Används kunskap och stöd?","",0,{"$f":"COUNT(IF(T16:BG16<>0,T16:BG16))","v":0},"",0,"","","","","","","","","","","","","","","","","","","","","","","","","","","","","","","","","","","","","","","",""]
[null,{"$f":"IFERROR( INDIRECT(\"'\"&$C17&\"'!$B$4\"), \"\")","v":""},"N9","",null,61,16,"Analyser som möjliggör lärande",4,16,"Patienter och närståendes erfarenheter av vårdskador","D. Beskrivning av utmaningar, hinder och möjliggörare",5,"Patienter och närståendes erfarenheter av vårdskadorD. Beskrivning av utmaningar, hinder och möjliggörare","",0,{"$f":"COUNT(IF(T17:BG17<>0,T17:BG17))","v":0},"",0,"","","","","","","","","","","","","","","","","","","","","","","","","","","","","","","","","","","","","","","",""]
[null,{"$f":"IFERROR( INDIRECT(\"'\"&$C18&\"'!$B$4\"), \"\")","v":""},"N10","",null,65,17,"Lärande från analyser och det egna arbetet",4,17,"Patientmedverkan i utveckling av processer och arbetssätt","A. Tillräcklig kunskap?",2,"Patientmedverkan i utveckling av processer och arbetssättA. Tillräcklig kunskap?","",0,{"$f":"COUNT(IF(T18:BG18<>0,T18:BG18))","v":0},"",0,"","","","","","","","","","","","","","","","","","","","","","","","","","","","","","","","","","","","","","","",""]
[null,{"$f":"IFERROR( INDIRECT(\"'\"&$C19&\"'!$B$4\"), \"\")","v":""},"N11","",null,69,18,"Spridning av kunskap och lärdomar",4,18,"Patientmedverkan i utveckling av processer och arbetssätt","B. Tillräckliga stöd?",3,"Patientmedverkan i utveckling av processer och arbetssättB. Tillräckliga stöd?","",0,{"$f":"COUNT(IF(T19:BG19<>0,T19:BG19))","v":0},"",0,"","","","","","","","","","","","","","","","","","","","","","","","","","","","","","","","","","","","","","","",""]
[null,{"$f":"IFERROR( INDIRECT(\"'\"&$C20&\"'!$B$4\"), \"\")","v":""},"N12","",null,73,19,"Riskkontroll",4,19,"Patientmedverkan i utveckling av processer och arbetssätt","C. Används kunskap och stöd?",4,"Patientmedverkan i utveckling av processer och arbetssättC. Används kunskap och stöd?","",0,{"$f":"COUNT(IF(T20:BG20<>0,T20:BG20))","v":0},"",0,"","","","","","","","","","","","","","","","","","","","","","","","","","","","","","","","","","","","","","","",""]
[null,{"$f":"IFERROR( INDIRECT(\"'\"&$C21&\"'!$B$4\"), \"\")","v":""},"N13","",null,77,20,"Färdighetsträning och simulering för ökad beredskap",4,20,"Patientmedverkan i utveckling av processer och arbetssätt","D. Beskrivning av utmaningar, hinder och möjliggörare",5,"Patientmedverkan i utveckling av processer och arbetssättD. Beskrivning av utmaningar, hinder och möjliggörare","",0,{"$f":"COUNT(IF(T21:BG21<>0,T21:BG21))","v":0},"",0,"","","","","","","","","","","","","","","","","","","","","","","","","","","","","","","","","","","","","","","",""]
[null,{"$f":"IFERROR( INDIRECT(\"'\"&$C22&\"'!$B$4\"), \"\")","v":""},"N14","",null,81,21,"Beredskap och planering för hantering av risker på lång sikt",4,21,"Patientens delaktighet i den egna vården","A. Tillräcklig kunskap?",2,"Patientens delaktighet i den egna vårdenA. Tillräcklig kunskap?","",0,{"$f":"COUNT(IF(T22:BG22<>0,T22:BG22))","v":0},"",0,"",{"$f":"IFERROR(VLOOKUP($K22, INDIRECT(\"'\"&U$1&\"'!$B$4:$F$46\"),$M22,FALSE),\"\")","v":""},"","","","","","","","","","","","","","","","","","","","","","","","","","","","","","","","","","","","","",""]
[null,{"$f":"IFERROR( INDIRECT(\"'\"&$C23&\"'!$B$4\"), \"\")","v":""},"N15","",null,85,22,"Omvärldsbevakning ur ett patientsäkerhetsperspektiv",4,22,"Patientens delaktighet i den egna vården","B. Tillräckliga stöd?",3,"Patientens delaktighet i den egna vårdenB. Tillräckliga stöd?","",0,{"$f":"COUNT(IF(T23:BG23<>0,T23:BG23))","v":0},"",0,"","","","","","","","","","","","","","","","","","","","","","","","","","","","","","","","","","","","","","","",""]
[null,{"$f":"IFERROR( INDIRECT(\"'\"&$C24&\"'!$B$4\"), \"\")","v":""},"N16","",null,89,23,null,4,23,"Patientens delaktighet i den egna vården","C. Används kunskap och stöd?",4,"Patientens delaktighet i den egna vårdenC. Används kunskap och stöd?","",0,{"$f":"COUNT(IF(T24:BG24<>0,T24:BG24))","v":0},"",0,"","","","","","","","","","","","","","","","","","","","","","","","","","","","","","","","","","","","","","","",""]
[null,{"$f":"IFERROR( INDIRECT(\"'\"&$C25&\"'!$B$4\"), \"\")","v":""},"N17","",null,93,24,null,4,24,"Patientens delaktighet i den egna vården","D. Beskrivning av utmaningar, hinder och möjliggörare",5,"Patientens delaktighet i den egna vårdenD. Beskrivning av utmaningar, hinder och möjliggörare","",0,{"$f":"COUNT(IF(T25:BG25<>0,T25:BG25))","v":0},"",0,"","","","","","","","","","","","","","","","","","","","","","","","","","","","","","","","","","","","","","","",""]
[null,{"$f":"IFERROR( INDIRECT(\"'\"&$C26&\"'!$B$4\"), \"\")","v":""},"N18","",null,97,25,null,4,25,"Patientmedverkan för ökad riskmedvetenhet och beredskap","A. Tillräcklig kunskap?",2,"Patientmedverkan för ökad riskmedvetenhet och beredskapA. Tillräcklig kunskap?","",0,{"$f":"COUNT(IF(T26:BG26<>0,T26:BG26))","v":0},"",0,"","","","","","","","","","","","","","","","","","","","","","","","","","","","","","","","","","","","","","","",""]
[null,{"$f":"IFERROR( INDIRECT(\"'\"&$C27&\"'!$B$4\"), \"\")","v":""},"N19","",null,101,26,null,4,26,"Patientmedverkan för ökad riskmedvetenhet och beredskap","B. Tillräckliga stöd?",3,"Patientmedverkan för ökad riskmedvetenhet och beredskapB. Tillräckliga stöd?","",0,{"$f":"COUNT(IF(T27:BG27<>0,T27:BG27))","v":0},"",0,"","","","","","","","","","","","","","","","","","","","","","","","","","","","","","","","","","","","","","","",""]
[null,{"$f":"IFERROR( INDIRECT(\"'\"&$C28&\"'!$B$4\"), \"\")","v":""},"N20","",null,105,27,null,4,27,"Patientmedverkan för ökad riskmedvetenhet och beredskap","C. Används kunskap och stöd?",4,"Patientmedverkan för ökad riskmedvetenhet och beredskapC. Används kunskap och stöd?","",0,{"$f":"COUNT(IF(T28:BG28<>0,T28:BG28))","v":0},"",0,"","","","","","","","","","","","","","","","","","","","","","",{"$f":"IFERROR(VLOOKUP($K28, INDIRECT(\"'\"&AP$1&\"'!$B$4:$F$46\"),$M28,FALSE),\"\")","v":""},"","","","","","","","","","","","","","","","",""]
[null,{"$f":"IFERROR( INDIRECT(\"'\"&$C29&\"'!$B$4\"), \"\")","v":""},"N21","",null,109,28,null,4,28,"Patientmedverkan för ökad riskmedvetenhet och beredskap","D. Beskrivning av utmaningar, hinder och möjliggörare",5,"Patientmedverkan för ökad riskmedvetenhet och beredskapD. Beskrivning av utmaningar, hinder och möjliggörare","",0,{"$f":"COUNT(IF(T29:BG29<>0,T29:BG29))","v":0},"",0,"","","","","","","","","","","","","","","","","","","","","","","","","","","","","","","","","","","","","","","",""]
[null,{"$f":"IFERROR( INDIRECT(\"'\"&$C30&\"'!$B$4\"), \"\")","v":""},"N22","",null,113,29,null,4,29,"Identifiering, sammanställning och aggregering av information om vårdskador","A. Tillräcklig kunskap?",2,"Identifiering, sammanställning och aggregering av information om vårdskadorA. Tillräcklig kunskap?","",0,{"$f":"COUNT(IF(T30:BG30<>0,T30:BG30))","v":0},"",0,"","","","","","","","","","","","","","","","","","","","","","","","","","","","","","","","","","","","","","","",""]
[null,{"$f":"IFERROR( INDIRECT(\"'\"&$C31&\"'!$B$4\"), \"\")","v":""},"N23","",null,117,30,null,4,30,"Identifiering, sammanställning och aggregering av information om vårdskador","B. Tillräckliga stöd?",3,"Identifiering, sammanställning och aggregering av information om vårdskadorB. Tillräckliga stöd?","",0,{"$f":"COUNT(IF(T31:BG31<>0,T31:BG31))","v":0},"",0,"","","","","","","","","","","","","","","","","","","","","","","","","","","","","","","","","","","","","","","",""]
[null,{"$f":"IFERROR( INDIRECT(\"'\"&$C32&\"'!$B$4\"), \"\")","v":""},"N24","",null,121,31,null,4,31,"Identifiering, sammanställning och aggregering av information om vårdskador","C. Används kunskap och stöd?",4,"Identifiering, sammanställning och aggregering av information om vårdskadorC. Används kunskap och stöd?","",0,{"$f":"COUNT(IF(T32:BG32<>0,T32:BG32))","v":0},"",0,"","","","","","","","","","","","","","","","","","","","","","","","","","","","","","","","","","","","","","","",""]
[null,{"$f":"IFERROR( INDIRECT(\"'\"&$C33&\"'!$B$4\"), \"\")","v":""},"N25","",null,125,32,null,4,32,"Identifiering, sammanställning och aggregering av information om vårdskador","D. Beskrivning av utmaningar, hinder och möjliggörare",5,"Identifiering, sammanställning och aggregering av information om vårdskadorD. Beskrivning av utmaningar, hinder och möjliggörare","",0,{"$f":"COUNT(IF(T33:BG33<>0,T33:BG33))","v":0},"",0,"","","","","","","","","","","","","","","","","","","","","","","","","","","","","","","","","","","","","","","",""]
[null,{"$f":"IFERROR( INDIRECT(\"'\"&$C34&\"'!$B$4\"), \"\")","v":""},"N26","",null,129,33,null,4,33,{"$f":"VLOOKUP($J34,$F$2:$H$34,3,TRUE)","v":"Minimering av effekter av negativa händelser"},"A. Tillräcklig kunskap?",2,"Minimering av effekter av negativa händelserA. Tillräcklig kunskap?","",0,{"$f":"COUNT(IF(T34:BG34<>0,T34:BG34))","v":0},"",0,"","","","","","","","","","","","","","","","","","","","","","","","","","","","","","","","","","","","","","","",""]
[null,{"$f":"IFERROR( INDIRECT(\"'\"&$C35&\"'!$B$4\"), \"\")","v":""},"N27","",null,null,null,null,null,34,"Minimering av effekter av negativa händelser","B. Tillräckliga stöd?",3,"Minimering av effekter av negativa händelserB. Tillräckliga stöd?","",0,{"$f":"COUNT(IF(T35:BG35<>0,T35:BG35))","v":0},"",0,"","","","",{"$f":"IFERROR(VLOOKUP($K35, INDIRECT(\"'\"&X$1&\"'!$B$4:$F$46\"),$M35,FALSE),\"\")","v":""},"","","","","","","","","","","","","","","","","","","","","","","","","","","","","","","","","","",""]
[null,{"$f":"IFERROR( INDIRECT(\"'\"&$C36&\"'!$B$4\"), \"\")","v":""},"N28","",null,null,null,null,null,35,"Minimering av effekter av negativa händelser","C. Används kunskap och stöd?",4,"Minimering av effekter av negativa händelserC. Används kunskap och stöd?","",0,{"$f":"COUNT(IF(T36:BG36<>0,T36:BG36))","v":0},"",0,"","","","","","","","","","","","","","","","","","","","","","","","","","","","","","","","","","","","","","","",""]
[null,{"$f":"IFERROR( INDIRECT(\"'\"&$C37&\"'!$B$4\"), \"\")","v":""},"N29","",null,null,null,null,null,36,"Minimering av effekter av negativa händelser","D. Beskrivning av utmaningar, hinder och möjliggörare",5,"Minimering av effekter av negativa händelserD. Beskrivning av utmaningar, hinder och möjliggörare","",0,{"$f":"COUNT(IF(T37:BG37<>0,T37:BG37))","v":0},"",0,"","","","","","","","","","","","","","","","","","","","","","","","","","","","","","","","","","","","","","","",""]
[null,{"$f":"IFERROR( INDIRECT(\"'\"&$C38&\"'!$B$4\"), \"\")","v":""},"N30","",null,null,null,null,null,37,"Tillförlitliga och säkra vårdprocesser och rutiner som omfattar patientens väg i hälso- och sjukvården","A. Tillräcklig kunskap?",2,"Tillförlitliga och säkra vårdprocesser och rutiner som omfattar patientens väg i hälso- och sjukvårdenA. Tillräcklig kunskap?","",0,{"$f":"COUNT(IF(T38:BG38<>0,T38:BG38))","v":0},"",0,"","","","","","","","","","","","","","","","","","","","","","","","","","","","","","","","","","","","","","","",""]
[null,{"$f":"IFERROR( INDIRECT(\"'\"&$C39&\"'!$B$4\"), \"\")","v":""},"N31","",null,null,null,null,null,38,"Tillförlitliga och säkra vårdprocesser och rutiner som omfattar patientens väg i hälso- och sjukvården","B. Tillräckliga stöd?",3,"Tillförlitliga och säkra vårdprocesser och rutiner som omfattar patientens väg i hälso- och sjukvårdenB. Tillräckliga stöd?","",0,{"$f":"COUNT(IF(T39:BG39<>0,T39:BG39))","v":0},"",0,"","","","","","","","","","","","","","","","","","","","","","","","","","","","","","","","","","","","","","","",""]
[null,{"$f":"IFERROR( INDIRECT(\"'\"&$C40&\"'!$B$4\"), \"\")","v":""},"N32","",null,null,null,null,null,39,"Tillförlitliga och säkra vårdprocesser och rutiner som omfattar patientens väg i hälso- och sjukvården","C. Används kunskap och stöd?",4,"Tillförlitliga och säkra vårdprocesser och rutiner som omfattar patientens väg i hälso- och sjukvårdenC. Används kunskap och stöd?","",0,{"$f":"COUNT(IF(T40:BG40<>0,T40:BG40))","v":0},"",0,"","","","","","","","","","","","","","","","","","","","","","","","","","","","","","","","","","","","","","","",""]
[null,{"$f":"IFERROR( INDIRECT(\"'\"&$C41&\"'!$B$4\"), \"\")","v":""},"N33","",null,null,null,null,null,40,"Tillförlitliga och säkra vårdprocesser och rutiner som omfattar patientens väg i hälso- och sjukvården","D. Beskrivning av utmaningar, hinder och möjliggörare",5,"Tillförlitliga och säkra vårdprocesser och rutiner som omfattar patientens väg i hälso- och sjukvårdenD. Beskrivning av utmaningar, hinder och möjliggörare","",0,{"$f":"COUNT(IF(T41:BG41<>0,T41:BG41))","v":0},"",0,"","","","","","","","","","","","","","","","","","","","","","","","","",{"$f":"IFERROR(VLOOKUP($K41, INDIRECT(\"'\"&AS$1&\"'!$B$4:$F$46\"),$M41,FALSE),\"\")","v":""},"","","","","","","","","","","","","",""]
[null,{"$f":"IFERROR( INDIRECT(\"'\"&$C42&\"'!$B$4\"), \"\")","v":""},"N34","",null,null,null,null,null,41,"Kunskapsbaserade verktyg, metoder och arbetssätt för ett patientsäkert arbete","A. Tillräcklig kunskap?",2,"Kunskapsbaserade verktyg, metoder och arbetssätt för ett patientsäkert arbeteA. Tillräcklig kunskap?","",0,{"$f":"COUNT(IF(T42:BG42<>0,T42:BG42))","v":0},"",0,"","","","","","","","","","","","","","","","","","","","","","","","","","","","","","","","","","","","","","","",""]
[null,{"$f":"IFERROR( INDIRECT(\"'\"&$C43&\"'!$B$4\"), \"\")","v":""},"N35","",null,null,2,"A. Tillräcklig kunskap?",2,42,"Kunskapsbaserade verktyg, metoder och arbetssätt för ett patientsäkert arbete","B. Tillräckliga stöd?",3,"Kunskapsbaserade verktyg, metoder och arbetssätt för ett patientsäkert arbeteB. Tillräckliga stöd?","",0,{"$f":"COUNT(IF(T43:BG43<>0,T43:BG43))","v":0},"",0,"","","","","","","","","","","","","","","","","","","","","","","","","","","","","","","","","","","","","","","",""]
[null,{"$f":"IFERROR( INDIRECT(\"'\"&$C44&\"'!$B$4\"), \"\")","v":""},"N36","",null,null,3,"B. Tillräckliga stöd?",3,43,"Kunskapsbaserade verktyg, metoder och arbetssätt för ett patientsäkert arbete","C. Används kunskap och stöd?",4,"Kunskapsbaserade verktyg, metoder och arbetssätt för ett patientsäkert arbeteC. Används kunskap och stöd?","",0,{"$f":"COUNT(IF(T44:BG44<>0,T44:BG44))","v":0},"",0,"","","","","","","","","","","","","","","","","","","","","","","","","","","","","","","","","","","","","","","",""]
[null,{"$f":"IFERROR( INDIRECT(\"'\"&$C45&\"'!$B$4\"), \"\")","v":""},"N37","",null,null,4,"C. Används kunskap och stöd?",4,44,"Kunskapsbaserade verktyg, metoder och arbetssätt för ett patientsäkert arbete","D. Beskrivning av utmaningar, hinder och möjliggörare",5,"Kunskapsbaserade verktyg, metoder och arbetssätt för ett patientsäkert arbeteD. Beskrivning av utmaningar, hinder och möjliggörare","",0,{"$f":"COUNT(IF(T45:BG45<>0,T45:BG45))","v":0},"",0,"","","","","","","","","","","","","","","","","","","","","","","","","","","","","","","","","","","","","","","",""]
[null,{"$f":"IFERROR( INDIRECT(\"'\"&$C46&\"'!$B$4\"), \"\")","v":""},"N38","",null,null,5,"D. Beskrivning av utmaningar, hinder och möjliggörare",5,45,"Medicinteknik, medicintekniska produkter, hjälpmedel och välfärdsteknik","A. Tillräcklig kunskap?",2,"Medicinteknik, medicintekniska produkter, hjälpmedel och välfärdsteknikA. Tillräcklig kunskap?","",0,{"$f":"COUNT(IF(T46:BG46<>0,T46:BG46))","v":0},"",0,"","","","","","","","","","","","","","","","","","","","","","","","","","","","","","","","","","","","","","","",""]
[null,{"$f":"IFERROR( INDIRECT(\"'\"&$C47&\"'!$B$4\"), \"\")","v":""},"N39","",null,null,null,null,null,46,"Medicinteknik, medicintekniska produkter, hjälpmedel och välfärdsteknik","B. Tillräckliga stöd?",3,"Medicinteknik, medicintekniska produkter, hjälpmedel och välfärdsteknikB. Tillräckliga stöd?","",0,{"$f":"COUNT(IF(T47:BG47<>0,T47:BG47))","v":0},"",0,"","","","","","","","","","","","","","","","","","","","","","","","","","","","","","","","","","","","","","","",""]
[null,{"$f":"IFERROR( INDIRECT(\"'\"&$C48&\"'!$B$4\"), \"\")","v":""},"N40","",null,null,null,null,null,47,"Medicinteknik, medicintekniska produkter, hjälpmedel och välfärdsteknik","C. Används kunskap och stöd?",4,"Medicinteknik, medicintekniska produkter, hjälpmedel och välfärdsteknikC. Används kunskap och stöd?","",0,{"$f":"COUNT(IF(T48:BG48<>0,T48:BG48))","v":0},"",0,"","","","","","","",{"$f":"IFERROR(VLOOKUP($K48, INDIRECT(\"'\"&AA$1&\"'!$B$4:$F$46\"),$M48,FALSE),\"\")","v":""},"","","","","","","","","","","","","","","","","","","","","","","","","","","","","","","",""]
[null,null,null,null,null,null,null,null,null,48,"Medicinteknik, medicintekniska produkter, hjälpmedel och välfärdsteknik","D. Beskrivning av utmaningar, hinder och möjliggörare",5,"Medicinteknik, medicintekniska produkter, hjälpmedel och välfärdsteknikD. Beskrivning av utmaningar, hinder och möjliggörare","",0,{"$f":"COUNT(IF(T49:BG49<>0,T49:BG49))","v":0},"",0,"","","","","","","","","","","","","","","","","","","","","","","","","","","","","","","","","","","","","","","",""]
[null,null,null,null,null,null,null,null,null,49,"Förmåga att förutse variationer och störningar i närtid","A. Tillräcklig kunskap?",2,"Förmåga att förutse variationer och störningar i närtidA. Tillräcklig kunskap?","",0,{"$f":"COUNT(IF(T50:BG50<>0,T50:BG50))","v":0},"",0,"","","","","","","","","","","","","","","","","","","","","","","","","","","","","","","","","","","","","","","",""]
[null,null,null,null,null,null,null,null,null,50,"Förmåga att förutse variationer och störningar i närtid","B. Tillräckliga stöd?",3,"Förmåga att förutse variationer och störningar i närtidB. Tillräckliga stöd?","",0,{"$f":"COUNT(IF(T51:BG51<>0,T51:BG51))","v":0},"",0,"","","","","","","","","","","","","","","","","","","","","","","","","","","","","","","","","","","","","","","",""]
[null,null,null,null,null,null,null,null,null,51,"Förmåga att förutse variationer och störningar i närtid","C. Används kunskap och stöd?",4,"Förmåga att förutse variationer och störningar i närtidC. Används kunskap och stöd?","",0,{"$f":"COUNT(IF(T52:BG52<>0,T52:BG52))","v":0},"",0,"","","","","","","","","","","","","","","","","","","","","","","","","","","","","","","","","","","","","","","",""]
[null,null,null,null,null,null,null,null,null,52,"Förmåga att förutse variationer och störningar i närtid","D. Beskrivning av utmaningar, hinder och möjliggörare",5,"Förmåga att förutse variationer och störningar i närtidD. Beskrivning av utmaningar, hinder och möjliggörare","",0,{"$f":"COUNT(IF(T53:BG53<>0,T53:BG53))","v":0},"",0,"","","","","","","","","","","","","","","","","","","","","","","","","","","","","","","","","","","","","","","",""]
[null,null,null,null,null,null,null,null,null,53,"Situationsanpassning","A. Tillräcklig kunskap?",2,"SituationsanpassningA. Tillräcklig kunskap?","",0,{"$f":"COUNT(IF(T54:BG54<>0,T54:BG54))","v":0},"",0,"","","","","","","","","","","","","","","","","","","","","","","","","","","","",{"$f":"IFERROR(VLOOKUP($K54, INDIRECT(\"'\"&AV$1&\"'!$B$4:$F$46\"),$M54,FALSE),\"\")","v":""},"","","","","","","","","","",""]
[null,null,null,null,null,null,null,null,null,54,"Situationsanpassning","B. Tillräckliga stöd?",3,"SituationsanpassningB. Tillräckliga stöd?","",0,{"$f":"COUNT(IF(T55:BG55<>0,T55:BG55))","v":0},"",0,"","","","","","","","","","","","","","","","","","","","","","","","","","","","","","","","","","","","","","","",""]
[null,null,null,null,null,null,null,null,null,55,"Situationsanpassning","C. Används kunskap och stöd?",4,"SituationsanpassningC. Används kunskap och stöd?","",0,{"$f":"COUNT(IF(T56:BG56<>0,T56:BG56))","v":0},"",0,"","","","","","","","","","","","","","","","","","","","","","","","","","","","","","","","","","","","","","","",""]
[null,null,null,null,null,null,null,null,null,56,"Situationsanpassning","D. Beskrivning av utmaningar, hinder och möjliggörare",5,"SituationsanpassningD. Beskrivning av utmaningar, hinder och möjliggörare","",0,{"$f":"COUNT(IF(T57:BG57<>0,T57:BG57))","v":0},"",0,"","","","","","","","","","","","","","","","","","","","","","","","","","","","","","","","","","","","","","","",""]
[null,null,null,null,null,null,null,null,null,57,"Uppföljning av patientsäkerheten genom insamling och sammanställnig av data från flera källor","A. Tillräcklig kunskap?",2,"Uppföljning av patientsäkerheten genom insamling och sammanställnig av data från flera källorA. Tillräcklig kunskap?","",0,{"$f":"COUNT(IF(T58:BG58<>0,T58:BG58))","v":0},"",0,"","","","","","","","","","","","","","","","","","","","","","","","","","","","","","","","","","","","","","","",""]
[null,null,null,null,null,null,null,null,null,58,"Uppföljning av patientsäkerheten genom insamling och sammanställnig av data från flera källor","B. Tillräckliga stöd?",3,"Uppföljning av patientsäkerheten genom insamling och sammanställnig av data från flera källorB. Tillräckliga stöd?","",0,{"$f":"COUNT(IF(T59:BG59<>0,T59:BG59))","v":0},"",0,"","","","","","","","","","","","","","","","","","","","","","","","","","","","","","","","","","","","","","","",""]
[null,null,null,null,null,null,null,null,null,59,"Uppföljning av patientsäkerheten genom insamling och sammanställnig av data från flera källor","C. Används kunskap och stöd?",4,"Uppföljning av patientsäkerheten genom insamling och sammanställnig av data från flera källorC. Används kunskap och stöd?","",0,{"$f":"COUNT(IF(T60:BG60<>0,T60:BG60))","v":0},"",0,"","","","","","","","","","","","","","","","","","","","","","","","","","","","","","","","","","","","","","","",""]
[null,null,null,null,null,null,null,null,null,60,"Uppföljning av patientsäkerheten genom insamling och sammanställnig av data från flera källor","D. Beskrivning av utmaningar, hinder och möjliggörare",5,"Uppföljning av patientsäkerheten genom insamling och sammanställnig av data från flera källorD. Beskrivning av utmaningar, hinder och möjliggörare","",0,{"$f":"COUNT(IF(T61:BG61<>0,T61:BG61))","v":0},"",0,"","","","","","","","","","",{"$f":"IFERROR(VLOOKUP($K61, INDIRECT(\"'\"&AD$1&\"'!$B$4:$F$46\"),$M61,FALSE),\"\")","v":""},"","","","","","","","","","","","","","","","","","","","","","","","","","","","",""]
[null,null,null,null,null,null,null,null,null,61,"Analyser som möjliggör lärande","A. Tillräcklig kunskap?",2,"Analyser som möjliggör lärandeA. Tillräcklig kunskap?","",0,{"$f":"COUNT(IF(T62:BG62<>0,T62:BG62))","v":0},"",0,"","","","","","","","","","","","","","","","","","","","","","","","","","","","","","","","","","","","","","","",""]
[null,null,null,null,null,null,null,null,null,62,"Analyser som möjliggör lärande","B. Tillräckliga stöd?",3,"Analyser som möjliggör lärandeB. Tillräckliga stöd?","",0,{"$f":"COUNT(IF(T63:BG63<>0,T63:BG63))","v":0},"",0,"","","","","","","","","","","","","","","","","","","","","","","","","","","","","","","","","","","","","","","",""]
[null,null,null,null,null,null,null,null,null,63,"Analyser som möjliggör lärande","C. Används kunskap och stöd?",4,"Analyser som möjliggör lärandeC. Används kunskap och stöd?","",0,{"$f":"COUNT(IF(T64:BG64<>0,T64:BG64))","v":0},"",0,"","","","","","","","","","","","","","","","","","","","","","","","","","","","","","","","","","","","","","","",""]
[null,null,null,null,null,null,null,null,null,64,"Analyser som möjliggör lärande","D. Beskrivning av utmaningar, hinder och möjliggörare",5,"Analyser som möjliggör lärandeD. Beskrivning av utmaningar, hinder och möjliggörare","",0,{"$f":"COUNT(IF(T65:BG65<>0,T65:BG65))","v":0},"",0,"","","","","","","","","","","","","","","","","","","","","","","","","","","","","","","","","","","","","","","",""]
[null,null,null,null,null,null,null,null,null,65,{"$f":"VLOOKUP($J66,$F$2:$H$34,3,TRUE)","v":"Lärande från analyser och det egna arbetet"},"A. Tillräcklig kunskap?",2,"Lärande från analyser och det egna arbetetA. Tillräcklig kunskap?",{"$f":"IFERROR(P66/Q66,\"\")","v":""},{"$f":"SUM(T66:BG66)","v":0},{"$f":"COUNT(IF(T66:BG66<>0,T66:BG66))","v":0},"",{"$f":"COUNTIF(T66:BG66,0)","v":0},"","","","","","","","","","","","","","","","","","","","","","","","","","","","","","","","","","","","","","","",""]
[null,null,null,null,null,null,null,null,null,66,"Lärande från analyser och det egna arbetet","B. Tillräckliga stöd?",{"$f":"VLOOKUP(L67,$H$43:$I$46,2,FALSE)","v":3},{"$f":"CONCATENATE(K67,L67)","v":"Lärande från analyser och det egna arbetetB. Tillräckliga stöd?"},"",0,{"$f":"COUNT(IF(T67:BG67<>0,T67:BG67))","v":0},{"$f":"IFERROR(S67/(Q67+S67),\"\")","v":""},0,{"$f":"IFERROR(VLOOKUP($K67, INDIRECT(\"'\"&T$1&\"'!$B$4:$F$46\"),$M67,FALSE),\"\")","v":""},"","","","","","","","","","","","","","","","","","","","","","","","","","","","","","","","","","","","","","",""]
[null,null,null,null,null,null,null,null,null,67,"Lärande från analyser och det egna arbetet","C. Används kunskap och stöd?",4,"Lärande från analyser och det egna arbetetC. Används kunskap och stöd?","",0,{"$f":"COUNT(IF(T68:BG68<>0,T68:BG68))","v":0},"",0,"","","","","","","",{"$f":"IFERROR(VLOOKUP($K68, INDIRECT(\"'\"&AA$1&\"'!$B$4:$F$46\"),$M68,FALSE),\"\")","v":""},"","","","","","","","","","","","","","","","","","","","","","","","","","","","","","","",""]
[null,null,null,null,null,null,null,null,null,68,"Lärande från analyser och det egna arbetet","D. Beskrivning av utmaningar, hinder och möjliggörare",5,"Lärande från analyser och det egna arbetetD. Beskrivning av utmaningar, hinder och möjliggörare","",0,{"$f":"COUNT(IF(T69:BG69<>0,T69:BG69))","v":0},"",0,"","","","","","","","","","","","","","","","","","","","","","","","","","","","","","","","","","","","","","","",""]
[null,null,null,null,null,null,null,null,null,69,"Spridning av kunskap och lärdomar","A. Tillräcklig kunskap?",2,"Spridning av kunskap och lärdomarA. Tillräcklig kunskap?","",0,{"$f":"COUNT(IF(T70:BG70<>0,T70:BG70))","v":0},"",0,"","","","","","","","","","","","","","","","","","","","","","","","","","","","","","","","","","","","","","","",""]
[null,null,null,null,null,null,null,null,null,70,"Spridning av kunskap och lärdomar","B. Tillräckliga stöd?",3,"Spridning av kunskap och lärdomarB. Tillräckliga stöd?","",0,{"$f":"COUNT(IF(T71:BG71<>0,T71:BG71))","v":0},"",0,"","","","","","","","","","","","","","","","","","","","","","","","","","","","","","","","","","","","","","","",""]
[null,null,null,null,null,null,null,null,null,71,"Spridning av kunskap och lärdomar","C. Används kunskap och stöd?",4,"Spridning av kunskap och lärdomarC. Används kunskap och stöd?","",0,{"$f":"COUNT(IF(T72:BG72<>0,T72:BG72))","v":0},"",0,"","","","","","","","","","","","","","","","","","","","","","","","","","","","","","","","","","","","","","","",""]
[null,null,null,null,null,null,null,null,null,72,"Spridning av kunskap och lärdomar","D. Beskrivning av utmaningar, hinder och möjliggörare",5,"Spridning av kunskap och lärdomarD. Beskrivning av utmaningar, hinder och möjliggörare","",0,{"$f":"COUNT(IF(T73:BG73<>0,T73:BG73))","v":0},"",0,"","","","","","","","","","","","","","","","","","","","","","","","","","","","","","","","","","","","","","","",""]
[null,null,null,null,null,null,null,null,null,73,"Riskkontroll","A. Tillräcklig kunskap?",2,"RiskkontrollA. Tillräcklig kunskap?","",0,{"$f":"COUNT(IF(T74:BG74<>0,T74:BG74))","v":0},"",0,"","","","","","","","","","","","","","","","","","","","","","","","","","","","",{"$f":"IFERROR(VLOOKUP($K74, INDIRECT(\"'\"&AV$1&\"'!$B$4:$F$46\"),$M74,FALSE),\"\")","v":""},"","","","","","","","","","",""]
[null,null,null,null,null,null,null,null,null,74,"Riskkontroll","B. Tillräckliga stöd?",3,"RiskkontrollB. Tillräckliga stöd?","",0,{"$f":"COUNT(IF(T75:BG75<>0,T75:BG75))","v":0},"",0,"","","","","","","","","","","","","","","","","","","","","","","","","","","","","","","","","","","","","","","",""]
[null,null,null,null,null,null,null,null,null,75,"Riskkontroll","C. Används kunskap och stöd?",4,"RiskkontrollC. Används kunskap och stöd?","",0,{"$f":"COUNT(IF(T76:BG76<>0,T76:BG76))","v":0},"",0,"","","","","","","","","","","","","","","","","","","","","","","","","","","","","","","","","","","","","","","",""]
[null,null,null,null,null,null,null,null,null,76,"Riskkontroll","D. Beskrivning av utmaningar, hinder och möjliggörare",5,"RiskkontrollD. Beskrivning av utmaningar, hinder och möjliggörare","",0,{"$f":"COUNT(IF(T77:BG77<>0,T77:BG77))","v":0},"",0,"","","","","","","","","","","","","","","","","","","","","","","","","","","","","","","","","","","","","","","",""]
[null,null,null,null,null,null,null,null,null,77,"Färdighetsträning och simulering för ökad beredskap","A. Tillräcklig kunskap?",2,"Färdighetsträning och simulering för ökad beredskapA. Tillräcklig kunskap?","",0,{"$f":"COUNT(IF(T78:BG78<>0,T78:BG78))","v":0},"",0,"","","","","","","","","","","","","","","","","","","","","","","","","","","","","","","","","","","","","","","",""]
[null,null,null,null,null,null,null,null,null,78,"Färdighetsträning och simulering för ökad beredskap","B. Tillräckliga stöd?",3,"Färdighetsträning och simulering för ökad beredskapB. Tillräckliga stöd?","",0,{"$f":"COUNT(IF(T79:BG79<>0,T79:BG79))","v":0},"",0,"","","","","","","","","","","","","","","","","","","","","","","","","","","","","","","","","","","","","","","",""]
[null,null,null,null,null,null,null,null,null,79,"Färdighetsträning och simulering för ökad beredskap","C. Används kunskap och stöd?",4,"Färdighetsträning och simulering för ökad beredskapC. Används kunskap och stöd?","",0,{"$f":"COUNT(IF(T80:BG80<>0,T80:BG80))","v":0},"",0,"","","","","","","","","","","","","","","","","","","","","","","","","","","","","","","","","","","","","","","",""]
[null,null,null,null,null,null,null,null,null,80,"Färdighetsträning och simulering för ökad beredskap","D. Beskrivning av utmaningar, hinder och möjliggörare",5,"Färdighetsträning och simulering för ökad beredskapD. Beskrivning av utmaningar, hinder och möjliggörare","",0,{"$f":"COUNT(IF(T81:BG81<>0,T81:BG81))","v":0},"",0,"","","","","","","","","","",{"$f":"IFERROR(VLOOKUP($K81, INDIRECT(\"'\"&AD$1&\"'!$B$4:$F$46\"),$M81,FALSE),\"\")","v":""},"","","","","","","","","","","","","","","","","","","","","","","","","","","","",""]
[null,null,null,null,null,null,null,null,null,81,"Beredskap och planering för hantering av risker på lång sikt","A. Tillräcklig kunskap?",2,"Beredskap och planering för hantering av risker på lång siktA. Tillräcklig kunskap?","",0,{"$f":"COUNT(IF(T82:BG82<>0,T82:BG82))","v":0},"",0,"","","","","","","","","","","","","","","","","","","","","","","","","","","","","","","","","","","","","","","",""]
[null,null,null,null,null,null,null,null,null,82,"Beredskap och planering för hantering av risker på lång sikt","B. Tillräckliga stöd?",3,"Beredskap och planering för hantering av risker på lång siktB. Tillräckliga stöd?","",0,{"$f":"COUNT(IF(T83:BG83<>0,T83:BG83))","v":0},"",0,"","","","","","","","","","","","","","","","","","","","","","","","","","","","","","","","","","","","","","","",""]
[null,null,null,null,null,null,null,null,null,83,"Beredskap och planering för hantering av risker på lång sikt","C. Används kunskap och stöd?",4,"Beredskap och planering för hantering av risker på lång siktC. Används kunskap och stöd?","",0,{"$f":"COUNT(IF(T84:BG84<>0,T84:BG84))","v":0},"",0,"","","","","","","","","","","","","","","","","","","","","","","","","","","","","","","","","","","","","","","",""]
[null,null,null,null,null,null,null,null,null,84,"Beredskap och planering för hantering av risker på lång sikt","D. Beskrivning av utmaningar, hinder och möjliggörare",5,"Beredskap och planering för hantering av risker på lång siktD. Beskrivning av utmaningar, hinder och möjliggörare","",0,{"$f":"COUNT(IF(T85:BG85<>0,T85:BG85))","v":0},"",0,"","","","","","","","","","","","","","","","","","","","","","","","","","","","","","","","","","","","","","","",""]
[null,null,null,null,null,null,null,null,null,85,"Omvärldsbevakning ur ett patientsäkerhetsperspektiv","A. Tillräcklig kunskap?",2,"Omvärldsbevakning ur ett patientsäkerhetsperspektivA. Tillräcklig kunskap?","",0,{"$f":"COUNT(IF(T86:BG86<>0,T86:BG86))","v":0},"",0,"","","","","","","","","","","","","","","","","","","","","","","","","","","","","","","","","","","","","","","",""]
[null,null,null,null,null,null,null,null,null,86,"Omvärldsbevakning ur ett patientsäkerhetsperspektiv","B. Tillräckliga stöd?",3,"Omvärldsbevakning ur ett patientsäkerhetsperspektivB. Tillräckliga stöd?","",0,{"$f":"COUNT(IF(T87:BG87<>0,T87:BG87))","v":0},"",0,"","","","","","","","","","","","","","","","","","","","","","","","","","","","","","","",{"$f":"IFERROR(VLOOKUP($K87, INDIRECT(\"'\"&AY$1&\"'!$B$4:$F$46\"),$M87,FALSE),\"\")","v":""},"","","","","","","",""]
[null,null,null,null,null,null,null,null,null,87,"Omvärldsbevakning ur ett patientsäkerhetsperspektiv","C. Används kunskap och stöd?",4,"Omvärldsbevakning ur ett patientsäkerhetsperspektivC. Används kunskap och stöd?","",0,{"$f":"COUNT(IF(T88:BG88<>0,T88:BG88))","v":0},"",0,"","","","","","","","","","","","","","","","","","","","","","","","","","","","","","","","","","","","","","","",""]
[null,null,null,null,null,null,null,null,null,88,"Omvärldsbevakning ur ett patientsäkerhetsperspektiv","D. Beskrivning av utmaningar, hinder och möjliggörare",5,"Omvärldsbevakning ur ett patientsäkerhetsperspektivD. Beskrivning av utmaningar, hinder och möjliggörare","",0,{"$f":"COUNT(IF(T89:BG89<>0,T89:BG89))","v":0},"",0,"","","","","","","","","","","","","","","","","","","","","","","","","","","","","","","","","","","","","","","",""]
[null,null,null,null,null,null,null,null,null,89,0,"A. Tillräcklig kunskap?",2,"0A. Tillräcklig kunskap?","",0,{"$f":"COUNT(IF(T90:BG90<>0,T90:BG90))","v":0},"",0,"","","","","","","","","","","","","","","","","","","","","","","","","","","","","","","","","","","","","","","",""]
[null,null,null,null,null,null,null,null,null,90,0,"B. Tillräckliga stöd?",3,"0B. Tillräckliga stöd?","",0,{"$f":"COUNT(IF(T91:BG91<>0,T91:BG91))","v":0},"",0,"","","","","","","","","","","","","","","","","","","","","","","","","","","","","","","","","","","","","","","",""]
[null,null,null,null,null,null,null,null,null,91,0,"C. Används kunskap och stöd?",4,"0C. Används kunskap och stöd?","",0,{"$f":"COUNT(IF(T92:BG92<>0,T92:BG92))","v":0},"",0,"","","","","","","","","","","","","","","","","","","","","","","","","","","","","","","","","","","","","","","",""]
[null,null,null,null,null,null,null,null,null,92,0,"D. Beskrivning av utmaningar, hinder och möjliggörare",5,"0D. Beskrivning av utmaningar, hinder och möjliggörare","",0,{"$f":"COUNT(IF(T93:BG93<>0,T93:BG93))","v":0},"",0,"","","","","","","","","","","","","","","","","","","","","","","","","","","","","","","","","","","","","","","",""]
[null,null,null,null,null,null,null,null,null,93,0,"A. Tillräcklig kunskap?",2,"0A. Tillräcklig kunskap?","",0,{"$f":"COUNT(IF(T94:BG94<>0,T94:BG94))","v":0},"",0,"","","","","","","","","","","","","",{"$f":"IFERROR(VLOOKUP($K94, INDIRECT(\"'\"&AG$1&\"'!$B$4:$F$46\"),$M94,FALSE),\"\")","v":""},"","","","","","","","","","","","","","","","","","","","","","","","","",""]
[null,null,null,null,null,null,null,null,null,94,0,"B. Tillräckliga stöd?",3,"0B. Tillräckliga stöd?","",0,{"$f":"COUNT(IF(T95:BG95<>0,T95:BG95))","v":0},"",0,"","","","","","","","","","","","","","","","","","","","","","","","","","","","","","","","","","","","","","","",""]
[null,null,null,null,null,null,null,null,null,95,0,"C. Används kunskap och stöd?",4,"0C. Används kunskap och stöd?","",0,{"$f":"COUNT(IF(T96:BG96<>0,T96:BG96))","v":0},"",0,"","","","","","","","","","","","","","","","","","","","","","","","","","","","","","","","","","","","","","","",""]
[null,null,null,null,null,null,null,null,null,96,0,"D. Beskrivning av utmaningar, hinder och möjliggörare",5,"0D. Beskrivning av utmaningar, hinder och möjliggörare","",0,{"$f":"COUNT(IF(T97:BG97<>0,T97:BG97))","v":0},"",0,"","","","","","","","","","","","","","","","","","","","","","","","","","","","","","","","","","","","","","","",""]
[null,null,null,null,null,null,null,null,null,97,0,"A. Tillräcklig kunskap?",2,"0A. Tillräcklig kunskap?","",0,{"$f":"COUNT(IF(T98:BG98<>0,T98:BG98))","v":0},"",0,"","","","","","","","","","","","","","","","","","","","","","","","","","","","","","","","","","","","","","","",""]
[null,null,null,null,null,null,null,null,null,98,0,"B. Tillräckliga stöd?",3,"0B. Tillräckliga stöd?","",0,{"$f":"COUNT(IF(T99:BG99<>0,T99:BG99))","v":0},"",0,"","","","","","","","","","","","","","","","","","","","","","","","","","","","","","","","","","","","","","","",""]
[null,null,null,null,null,null,null,null,null,99,0,"C. Används kunskap och stöd?",4,"0C. Används kunskap och stöd?","",0,{"$f":"COUNT(IF(T100:BG100<>0,T100:BG100))","v":0},"",0,"","","","","","","","","","","","","","","","","","","","","","","","","","","","","","","","","","",{"$f":"IFERROR(VLOOKUP($K100, INDIRECT(\"'\"&BB$1&\"'!$B$4:$F$46\"),$M100,FALSE),\"\")","v":""},"","","","",""]
[null,null,null,null,null,null,null,null,null,100,{"$f":"VLOOKUP($J101,$F$2:$H$34,3,TRUE)","v":0},"D. Beskrivning av utmaningar, hinder och möjliggörare",5,{"$f":"CONCATENATE(K101,L101)","v":"0D. Beskrivning av utmaningar, hinder och möjliggörare"},"",0,{"$f":"COUNT(IF(T101:BG101<>0,T101:BG101))","v":0},"",0,"","","","","","","","","","","","","","","","","","","","","","","","","","","","","","","","","","","","","","","",""]
[null,null,null,null,null,null,null,null,null,101,0,"A. Tillräcklig kunskap?",2,{"$f":"CONCATENATE(K102,L102)","v":"0A. Tillräcklig kunskap?"},"",0,{"$f":"COUNT(IF(T102:BG102<>0,T102:BG102))","v":0},"",0,"","","","","","","","","","","","","","","","","","","","","","","","","","","","","","","","","","","","","","","",""]
[null,null,null,null,null,null,null,null,null,102,0,"B. Tillräckliga stöd?",3,"0B. Tillräckliga stöd?","",0,{"$f":"COUNT(IF(T103:BG103<>0,T103:BG103))","v":0},"",0,"","","","","","","","","","","","","","","","","","","","","","","","","","","","","","","","","","","","","","","",""]
[null,null,null,null,null,null,null,null,null,103,0,"C. Används kunskap och stöd?",4,"0C. Används kunskap och stöd?","",0,{"$f":"COUNT(IF(T104:BG104<>0,T104:BG104))","v":0},"",0,"","","","","","","","","","","","","","","","","","","","","","","","","","","","","","","","","","","","","","","",""]
[null,null,null,null,null,null,null,null,null,104,0,"D. Beskrivning av utmaningar, hinder och möjliggörare",5,"0D. Beskrivning av utmaningar, hinder och möjliggörare","",0,{"$f":"COUNT(IF(T105:BG105<>0,T105:BG105))","v":0},"",0,"","","","","","","","","","","","","","","","","","","","","","","","","","","","","","","","","","","","","","","",""]
[null,null,null,null,null,null,null,null,null,105,0,"A. Tillräcklig kunskap?",2,"0A. Tillräcklig kunskap?","",0,{"$f":"COUNT(IF(T106:BG106<>0,T106:BG106))","v":0},"",0,"","","","","","","","","","","","","","","","","","","","","","","","","","","","","","","","","","","","","","","",""]
[null,null,null,null,null,null,null,null,null,106,0,"B. Tillräckliga stöd?",3,"0B. Tillräckliga stöd?","",0,{"$f":"COUNT(IF(T107:BG107<>0,T107:BG107))","v":0},"",0,"","","","","","","","","","","","","","","","",{"$f":"IFERROR(VLOOKUP($K107, INDIRECT(\"'\"&AJ$1&\"'!$B$4:$F$46\"),$M107,FALSE),\"\")","v":""},"","","","","","","","","","","","","","","","","","","","","","",""]
[null,null,null,null,null,null,null,null,null,107,0,"C. Används kunskap och stöd?",4,"0C. Används kunskap och stöd?","",0,{"$f":"COUNT(IF(T108:BG108<>0,T108:BG108))","v":0},"",0,"","","","","","","","","","","","","","","","","","","","","","","","","","","","","","","","","","","","","","","",""]
[null,null,null,null,null,null,null,null,null,108,0,"D. Beskrivning av utmaningar, hinder och möjliggörare",5,"0D. Beskrivning av utmaningar, hinder och möjliggörare","",0,{"$f":"COUNT(IF(T109:BG109<>0,T109:BG109))","v":0},"",0,"","","","","","","","","","","","","","","","","","","","","","","","","","","","","","","","","","","","","","","",""]
[null,null,null,null,null,null,null,null,null,109,0,"A. Tillräcklig kunskap?",2,"0A. Tillräcklig kunskap?","",0,{"$f":"COUNT(IF(T110:BG110<>0,T110:BG110))","v":0},"",0,"","","","","","","","","","","","","","","","","","","","","","","","","","","","","","","","","","","","","","","",""]
[null,null,null,null,null,null,null,null,null,110,0,"B. Tillräckliga stöd?",3,"0B. Tillräckliga stöd?","",0,{"$f":"COUNT(IF(T111:BG111<>0,T111:BG111))","v":0},"",0,"","","","","","","","","","","","","","","","","","","","","","","","","","","","","","","","","","","","","","","",""]
[null,null,null,null,null,null,null,null,null,111,0,"C. Används kunskap och stöd?",4,"0C. Används kunskap och stöd?","",0,{"$f":"COUNT(IF(T112:BG112<>0,T112:BG112))","v":0},"",0,"","","","","","","","","","","","","","","","","","","","","","","","","","","","","","","","","","","","","","","",""]
[null,null,null,null,null,null,null,null,null,112,0,"D. Beskrivning av utmaningar, hinder och möjliggörare",5,"0D. Beskrivning av utmaningar, hinder och möjliggörare","",0,{"$f":"COUNT(IF(T113:BG113<>0,T113:BG113))","v":0},"",0,"","","","","","","","","","","","","","","","","","","","","","","","","","","","","","","","","","","","","",{"$f":"IFERROR(VLOOKUP($K113, INDIRECT(\"'\"&BE$1&\"'!$B$4:$F$46\"),$M113,FALSE),\"\")","v":""},"",""]
[null,null,null,null,null,null,null,null,null,113,0,"A. Tillräcklig kunskap?",2,"0A. Tillräcklig kunskap?","",0,{"$f":"COUNT(IF(T114:BG114<>0,T114:BG114))","v":0},"",0,"","","","","","","","","","","","","","","","","","","","","","","","","","","","","","","","","","","","","","","",""]
[null,null,null,null,null,null,null,null,null,114,0,"B. Tillräckliga stöd?",3,"0B. Tillräckliga stöd?","",0,{"$f":"COUNT(IF(T115:BG115<>0,T115:BG115))","v":0},"",0,"","","","","","","","","","","","","","","","","","","","","","","","","","","","","","","","","","","","","","","",""]
[null,null,null,null,null,null,null,null,null,115,0,"C. Används kunskap och stöd?",4,"0C. Används kunskap och stöd?","",0,{"$f":"COUNT(IF(T116:BG116<>0,T116:BG116))","v":0},"",0,"","","","","","","","","","","","","","","","","","","","","","","","","","","","","","","","","","","","","","","",""]
[null,null,null,null,null,null,null,null,null,116,0,"D. Beskrivning av utmaningar, hinder och möjliggörare",5,"0D. Beskrivning av utmaningar, hinder och möjliggörare","",0,{"$f":"COUNT(IF(T117:BG117<>0,T117:BG117))","v":0},"",0,"","","","","","","","","","","","","","","","","","","","","","","","","","","","","","","","","","","","","","","",""]
[null,null,null,null,null,null,null,null,null,117,0,"A. Tillräcklig kunskap?",2,"0A. Tillräcklig kunskap?","",0,{"$f":"COUNT(IF(T118:BG118<>0,T118:BG118))","v":0},"",0,"","","","","","","","","","","","","","","","","","","","","","","","","","","","","","","","","","","","","","","",""]
[null,null,null,null,null,null,null,null,null,118,0,"B. Tillräckliga stöd?",3,"0B. Tillräckliga stöd?","",0,{"$f":"COUNT(IF(T119:BG119<>0,T119:BG119))","v":0},"",0,"","","","","","","","","","","","","","","","","","","","","","","","","","","","","","","","","","","","","","","",""]
[null,null,null,null,null,null,null,null,null,119,0,"C. Används kunskap och stöd?",4,"0C. Används kunskap och stöd?","",0,{"$f":"COUNT(IF(T120:BG120<>0,T120:BG120))","v":0},"",0,"","","","","","","","","","","","","","","","","","","",{"$f":"IFERROR(VLOOKUP($K120, INDIRECT(\"'\"&AM$1&\"'!$B$4:$F$46\"),$M120,FALSE),\"\")","v":""},"","","","","","","","","","","","","","","","","","","",""]
[null,null,null,null,null,null,null,null,null,120,0,"D. Beskrivning av utmaningar, hinder och möjliggörare",5,"0D. Beskrivning av utmaningar, hinder och möjliggörare","",0,{"$f":"COUNT(IF(T121:BG121<>0,T121:BG121))","v":0},"",0,"","","","","","","","","","","","","","","","","","","","","","","","","","","","","","","","","","","","","","","",""]
[null,null,null,null,null,null,null,null,null,121,0,"A. Tillräcklig kunskap?",2,"0A. Tillräcklig kunskap?","",0,{"$f":"COUNT(IF(T122:BG122<>0,T122:BG122))","v":0},"",0,"","","","","","","","","","","","","","","","","","","","","","","","","","","","","","","","","","","","","","","",""]
[null,null,null,null,null,null,null,null,null,122,0,"B. Tillräckliga stöd?",3,"0B. Tillräckliga stöd?","",0,{"$f":"COUNT(IF(T123:BG123<>0,T123:BG123))","v":0},"",0,"","","","","","","","","","","","","","","","","","","","","","","","","","","","","","","","","","","","","","","",""]
[null,null,null,null,null,null,null,null,null,123,0,"C. Används kunskap och stöd?",4,"0C. Används kunskap och stöd?","",0,{"$f":"COUNT(IF(T124:BG124<>0,T124:BG124))","v":0},"",0,"","","","","","","","","","","","","","","","","","","","","","","","","","","","","","","","","","","","","","","",""]
[null,null,null,null,null,null,null,null,null,124,0,"D. Beskrivning av utmaningar, hinder och möjliggörare",5,"0D. Beskrivning av utmaningar, hinder och möjliggörare","",0,{"$f":"COUNT(IF(T125:BG125<>0,T125:BG125))","v":0},"",0,"","","","","","","","","","","","","","","","","","","","","","","","","","","","","","","","","","","","","","","",""]
[null,null,null,null,null,null,null,null,null,125,0,"A. Tillräcklig kunskap?",2,"0A. Tillräcklig kunskap?","",0,{"$f":"COUNT(IF(T126:BG126<>0,T126:BG126))","v":0},"",0,"","","","","","","","","","","","","","","","","","","","","","","","","","","","","","","","","","","","","","","",""]
[null,null,null,null,null,null,null,null,null,126,0,"B. Tillräckliga stöd?",3,"0B. Tillräckliga stöd?","",0,{"$f":"COUNT(IF(T127:BG127<>0,T127:BG127))","v":0},"",0,"",{"$f":"IFERROR(VLOOKUP($K127, INDIRECT(\"'\"&U$1&\"'!$B$4:$F$46\"),$M127,FALSE),\"\")","v":""},"","","","","","","","","","","","","","","","","","","","","","","","","","","","","","","","","","","","","",""]
[null,null,null,null,null,null,null,null,null,127,0,"C. Används kunskap och stöd?",4,"0C. Används kunskap och stöd?","",0,{"$f":"COUNT(IF(T128:BG128<>0,T128:BG128))","v":0},"",0,"","","","","","","","","","","","","","","","","","","","","","","","","","","","","","","","","","","","","","","",""]
[null,null,null,null,null,null,null,null,null,128,0,"D. Beskrivning av utmaningar, hinder och möjliggörare",5,"0D. Beskrivning av utmaningar, hinder och möjliggörare","",0,{"$f":"COUNT(IF(T129:BG129<>0,T129:BG129))","v":0},"",0,"","","","","","","","","","","","","","","","","","","","","","","","","","","","","","","","","","","","","","","",""]
[null,null,null,null,null,null,null,null,null,129,0,"A. Tillräcklig kunskap?",2,"0A. Tillräcklig kunskap?",{"$f":"IFERROR(P130/Q130,\"\")","v":""},{"$f":"SUM(T130:BG130)","v":0},{"$f":"COUNT(IF(T130:BG130<>0,T130:BG130))","v":0},"",{"$f":"COUNTIF(T130:BG130,0)","v":0},"","","","","","","","","","","","","","","","","","","","","","","","","","","","","","","","","","","","","","","",""]
[null,null,null,null,null,null,null,null,null,130,0,"B. Tillräckliga stöd?",{"$f":"VLOOKUP(L131,$H$43:$I$46,2,FALSE)","v":3},"0B. Tillräckliga stöd?","",0,{"$f":"COUNT(IF(T131:BG131<>0,T131:BG131))","v":0},{"$f":"IFERROR(S131/(Q131+S131),\"\")","v":""},0,{"$f":"IFERROR(VLOOKUP($K131, INDIRECT(\"'\"&T$1&\"'!$B$4:$F$46\"),$M131,FALSE),\"\")","v":""},"","","","","","","","","","","","","","","","","","","","","","","","","","","","","","","","","","","","","","",""]
[null,null,null,null,null,null,null,null,null,131,0,"C. Används kunskap och stöd?",4,"0C. Används kunskap och stöd?","",0,{"$f":"COUNT(IF(T132:BG132<>0,T132:BG132))","v":0},"",0,"","","","","","","","","","","","","","","","","","","","","","","","","","","","","","","","","","","","","","","",""]
[null,null,null,null,null,null,null,null,null,132,0,"D. Beskrivning av utmaningar, hinder och möjliggörare",5,"0D. Beskrivning av utmaningar, hinder och möjliggörare","",0,{"$f":"COUNT(IF(T133:BG133<>0,T133:BG133))","v":0},"",0,"","","","","","","","","","","","","","","","","","","","","","","","","","","","","","","","","","","","","",{"$f":"IFERROR(VLOOKUP($K133, INDIRECT(\"'\"&BE$1&\"'!$B$4:$F$46\"),$M133,FALSE),\"\")","v":""},"",""]

{"sheet":"S datadyn","index":2,"n_rows":478,"n_cols":42,"rows_kept":478,"cut":false,"hidden":true,"merged":[[1,11,1,14]]}
[]
[null,"Svarande","Område","Tema","Insats","Aktör","Kontakt","Uppskattad resursåtgång","Förväntad effekt","Prio-värde",null,"Tips: Använd pilknapparna för att filtrera ut insatser ex. inom ett visst tema eller för att sortera insatserna i en annan ordning",null,null,null,null,null,null,null,null,{"$f":"LEN(V2)","v":23},"Nulägesanalysen avser: ","fliknamn",null,"Finns fliken?","hjälpkolumn1","Fliknamn","Antal rader som inte är tomma","hjälpkolumn2","Vlookup till sammanställningen","Offset",null,1,2,3,4,5,6,7,8,9,10]
[null,{"$f":"IF($AE3<>\"\",VLOOKUP(AD3,$W$3:$X$42,2,FALSE),\"\")","v":""},{"$f":"IF($AE3<>\"\",INDEX(INDIRECT(\"'\"&$AD3&\"'!$B$7:$I$100\"),$AE3,AG$2),\"\")","v":""},{"$f":"IF($AE3<>\"\",INDEX(INDIRECT(\"'\"&$AD3&\"'!$B$7:$I$100\"),$AE3,AH$2),\"\")","v":""},{"$f":"IF($AE3<>\"\",INDEX(INDIRECT(\"'\"&$AD3&\"'!$B$7:$I$100\"),$AE3,AI$2),\"\")","v":""},{"$f":"IF($AE3<>\"\",INDEX(INDIRECT(\"'\"&$AD3&\"'!$B$7:$I$100\"),$AE3,AJ$2),\"\")","v":""},{"$f":"IF($AE3<>\"\",INDEX(INDIRECT(\"'\"&$AD3&\"'!$B$7:$I$100\"),$AE3,AK$2),\"\")","v":""},{"$f":"IF($AE3<>\"\",INDEX(INDIRECT(\"'\"&$AD3&\"'!$B$7:$I$100\"),$AE3,AL$2),\"\")","v":""},{"$f":"IF($AE3<>\"\",INDEX(INDIRECT(\"'\"&$AD3&\"'!$B$7:$I$100\"),$AE3,AM$2),\"\")","v":""},{"$f":"IF($AE3<>\"\",INDEX(INDIRECT(\"'\"&$AD3&\"'!$B$7:$I$100\"),$AE3,AN$2),\"\")","v":""},null,null,null,null,null,null,null,null,null,null,null,{"$f":"IFERROR( INDIRECT(\"'\"&$W3&\"'!$B$4\"), \"\")","v":""},"S1",{"$f":"V3","v":""},{"$f":"ISREF(INDIRECT(\"'\"&$W3&\"'!A1\"))","v":false},1,"S1",{"$f":"IF(Y3=TRUE,COUNTA(INDIRECT(\"'\"&$W3&\"'!$B$7\"):INDIRECT(\"'\"&$W3&\"'!$B$64\")),\"\")","v":""},1,{"$f":"VLOOKUP(AC3,$Z$3:$AA41,2)","v":"S1"},{"$f":"IF(VLOOKUP(AD3,$W$3:$AD$102,3,FALSE)=TRUE,1,\"\")","v":""}]
[null,{"$f":"IF($AE4<>\"\",VLOOKUP(AD4,$W$3:$X$42,2,FALSE),\"\")","v":""},{"$f":"IF($AE4<>\"\",INDEX(INDIRECT(\"'\"&$AD4&\"'!$B$7:$I$100\"),$AE4,AG$2),\"\")","v":""},{"$f":"IF($AE4<>\"\",INDEX(INDIRECT(\"'\"&$AD4&\"'!$B$7:$I$100\"),$AE4,AH$2),\"\")","v":""},{"$f":"IF($AE4<>\"\",INDEX(INDIRECT(\"'\"&$AD4&\"'!$B$7:$I$100\"),$AE4,AI$2),\"\")","v":""},{"$f":"IF($AE4<>\"\",INDEX(INDIRECT(\"'\"&$AD4&\"'!$B$7:$I$100\"),$AE4,AJ$2),\"\")","v":""},{"$f":"IF($AE4<>\"\",INDEX(INDIRECT(\"'\"&$AD4&\"'!$B$7:$I$100\"),$AE4,AK$2),\"\")","v":""},{"$f":"IF($AE4<>\"\",INDEX(INDIRECT(\"'\"&$AD4&\"'!$B$7:$I$100\"),$AE4,AL$2),\"\")","v":""},{"$f":"IF($AE4<>\"\",INDEX(INDIRECT(\"'\"&$AD4&\"'!$B$7:$I$100\"),$AE4,AM$2),\"\")","v":""},{"$f":"IF($AE4<>\"\",INDEX(INDIRECT(\"'\"&$AD4&\"'!$B$7:$I$100\"),$AE4,AN$2),\"\")","v":""},null,null,null,null,null,null,null,null,null,null,null,{"$f":"IFERROR( INDIRECT(\"'\"&$W4&\"'!$B$4\"), \"\")","v":""},"S2",{"$f":"V4","v":""},{"$f":"ISREF(INDIRECT(\"'\"&$W4&\"'!A1\"))","v":false},{"$f":"AB3+Z3","v":{"$error":"#VALUE!"}},"S2",{"$f":"IF(Y4=TRUE,COUNTA(INDIRECT(\"'\"&$W4&\"'!$B$7\"):INDIRECT(\"'\"&$W4&\"'!$B$64\")),\"\")","v":""},2,{"$f":"VLOOKUP(AC4,$Z$3:$AA42,2)","v":"S1"},{"$f":"IF(VLOOKUP(AD4,$W$3:$AD$102,3,FALSE)=TRUE,IF(AD4=AD3,AE3+1,1),\"\")","v":""}]
[null,"",{"$f":"IF($AE5<>\"\",INDEX(INDIRECT(\"'\"&$AD5&\"'!$B$7:$I$100\"),$AE5,AG$2),\"\")","v":""},{"$f":"IF($AE5<>\"\",INDEX(INDIRECT(\"'\"&$AD5&\"'!$B$7:$I$100\"),$AE5,AH$2),\"\")","v":""},{"$f":"IF($AE5<>\"\",INDEX(INDIRECT(\"'\"&$AD5&\"'!$B$7:$I$100\"),$AE5,AI$2),\"\")","v":""},{"$f":"IF($AE5<>\"\",INDEX(INDIRECT(\"'\"&$AD5&\"'!$B$7:$I$100\"),$AE5,AJ$2),\"\")","v":""},{"$f":"IF($AE5<>\"\",INDEX(INDIRECT(\"'\"&$AD5&\"'!$B$7:$I$100\"),$AE5,AK$2),\"\")","v":""},{"$f":"IF($AE5<>\"\",INDEX(INDIRECT(\"'\"&$AD5&\"'!$B$7:$I$100\"),$AE5,AL$2),\"\")","v":""},{"$f":"IF($AE5<>\"\",INDEX(INDIRECT(\"'\"&$AD5&\"'!$B$7:$I$100\"),$AE5,AM$2),\"\")","v":""},{"$f":"IF($AE5<>\"\",INDEX(INDIRECT(\"'\"&$AD5&\"'!$B$7:$I$100\"),$AE5,AN$2),\"\")","v":""},null,null,null,null,null,null,null,null,null,null,null,{"$f":"IFERROR( INDIRECT(\"'\"&$W5&\"'!$B$4\"), \"\")","v":""},"S3","",false,{"$error":"#VALUE!"},"S3",{"$f":"IF(Y5=TRUE,COUNTA(INDIRECT(\"'\"&$W5&\"'!$B$7\"):INDIRECT(\"'\"&$W5&\"'!$B$64\")),\"\")","v":""},3,{"$f":"VLOOKUP(AC5,$Z$3:$AA43,2)","v":"S1"},{"$f":"IF(VLOOKUP(AD5,$W$3:$AD$102,3,FALSE)=TRUE,IF(AD5=AD4,AE4+1,1),\"\")","v":""}]
[null,"",{"$f":"IF($AE6<>\"\",INDEX(INDIRECT(\"'\"&$AD6&\"'!$B$7:$I$100\"),$AE6,AG$2),\"\")","v":""},{"$f":"IF($AE6<>\"\",INDEX(INDIRECT(\"'\"&$AD6&\"'!$B$7:$I$100\"),$AE6,AH$2),\"\")","v":""},{"$f":"IF($AE6<>\"\",INDEX(INDIRECT(\"'\"&$AD6&\"'!$B$7:$I$100\"),$AE6,AI$2),\"\")","v":""},{"$f":"IF($AE6<>\"\",INDEX(INDIRECT(\"'\"&$AD6&\"'!$B$7:$I$100\"),$AE6,AJ$2),\"\")","v":""},{"$f":"IF($AE6<>\"\",INDEX(INDIRECT(\"'\"&$AD6&\"'!$B$7:$I$100\"),$AE6,AK$2),\"\")","v":""},{"$f":"IF($AE6<>\"\",INDEX(INDIRECT(\"'\"&$AD6&\"'!$B$7:$I$100\"),$AE6,AL$2),\"\")","v":""},{"$f":"IF($AE6<>\"\",INDEX(INDIRECT(\"'\"&$AD6&\"'!$B$7:$I$100\"),$AE6,AM$2),\"\")","v":""},{"$f":"IF($AE6<>\"\",INDEX(INDIRECT(\"'\"&$AD6&\"'!$B$7:$I$100\"),$AE6,AN$2),\"\")","v":""},null,null,null,null,null,null,null,null,null,null,null,{"$f":"IFERROR( INDIRECT(\"'\"&$W6&\"'!$B$4\"), \"\")","v":""},"S4","",false,{"$error":"#VALUE!"},"S4",{"$f":"IF(Y6=TRUE,COUNTA(INDIRECT(\"'\"&$W6&\"'!$B$7\"):INDIRECT(\"'\"&$W6&\"'!$B$64\")),\"\")","v":""},4,{"$f":"VLOOKUP(AC6,$Z$3:$AA44,2)","v":"S1"},""]
[null,"",{"$f":"IF($AE7<>\"\",INDEX(INDIRECT(\"'\"&$AD7&\"'!$B$7:$I$100\"),$AE7,AG$2),\"\")","v":""},{"$f":"IF($AE7<>\"\",INDEX(INDIRECT(\"'\"&$AD7&\"'!$B$7:$I$100\"),$AE7,AH$2),\"\")","v":""},{"$f":"IF($AE7<>\"\",INDEX(INDIRECT(\"'\"&$AD7&\"'!$B$7:$I$100\"),$AE7,AI$2),\"\")","v":""},{"$f":"IF($AE7<>\"\",INDEX(INDIRECT(\"'\"&$AD7&\"'!$B$7:$I$100\"),$AE7,AJ$2),\"\")","v":""},{"$f":"IF($AE7<>\"\",INDEX(INDIRECT(\"'\"&$AD7&\"'!$B$7:$I$100\"),$AE7,AK$2),\"\")","v":""},{"$f":"IF($AE7<>\"\",INDEX(INDIRECT(\"'\"&$AD7&\"'!$B$7:$I$100\"),$AE7,AL$2),\"\")","v":""},{"$f":"IF($AE7<>\"\",INDEX(INDIRECT(\"'\"&$AD7&\"'!$B$7:$I$100\"),$AE7,AM$2),\"\")","v":""},{"$f":"IF($AE7<>\"\",INDEX(INDIRECT(\"'\"&$AD7&\"'!$B$7:$I$100\"),$AE7,AN$2),\"\")","v":""},null,null,null,null,null,null,null,null,null,null,null,{"$f":"IFERROR( INDIRECT(\"'\"&$W7&\"'!$B$4\"), \"\")","v":""},"S5","",false,{"$error":"#VALUE!"},"S5",{"$f":"IF(Y7=TRUE,COUNTA(INDIRECT(\"'\"&$W7&\"'!$B$7\"):INDIRECT(\"'\"&$W7&\"'!$B$64\")),\"\")","v":""},5,{"$f":"VLOOKUP(AC7,$Z$3:$AA45,2)","v":"S1"},""]
[null,"",{"$f":"IF($AE8<>\"\",INDEX(INDIRECT(\"'\"&$AD8&\"'!$B$7:$I$100\"),$AE8,AG$2),\"\")","v":""},{"$f":"IF($AE8<>\"\",INDEX(INDIRECT(\"'\"&$AD8&\"'!$B$7:$I$100\"),$AE8,AH$2),\"\")","v":""},{"$f":"IF($AE8<>\"\",INDEX(INDIRECT(\"'\"&$AD8&\"'!$B$7:$I$100\"),$AE8,AI$2),\"\")","v":""},{"$f":"IF($AE8<>\"\",INDEX(INDIRECT(\"'\"&$AD8&\"'!$B$7:$I$100\"),$AE8,AJ$2),\"\")","v":""},{"$f":"IF($AE8<>\"\",INDEX(INDIRECT(\"'\"&$AD8&\"'!$B$7:$I$100\"),$AE8,AK$2),\"\")","v":""},{"$f":"IF($AE8<>\"\",INDEX(INDIRECT(\"'\"&$AD8&\"'!$B$7:$I$100\"),$AE8,AL$2),\"\")","v":""},{"$f":"IF($AE8<>\"\",INDEX(INDIRECT(\"'\"&$AD8&\"'!$B$7:$I$100\"),$AE8,AM$2),\"\")","v":""},{"$f":"IF($AE8<>\"\",INDEX(INDIRECT(\"'\"&$AD8&\"'!$B$7:$I$100\"),$AE8,AN$2),\"\")","v":""},null,null,null,null,null,null,null,null,null,null,null,{"$f":"IFERROR( INDIRECT(\"'\"&$W8&\"'!$B$4\"), \"\")","v":""},"S6","",false,{"$error":"#VALUE!"},"S6",{"$f":"IF(Y8=TRUE,COUNTA(INDIRECT(\"'\"&$W8&\"'!$B$7\"):INDIRECT(\"'\"&$W8&\"'!$B$64\")),\"\")","v":""},6,{"$f":"VLOOKUP(AC8,$Z$3:$AA46,2)","v":"S1"},""]
[null,"",{"$f":"IF($AE9<>\"\",INDEX(INDIRECT(\"'\"&$AD9&\"'!$B$7:$I$100\"),$AE9,AG$2),\"\")","v":""},{"$f":"IF($AE9<>\"\",INDEX(INDIRECT(\"'\"&$AD9&\"'!$B$7:$I$100\"),$AE9,AH$2),\"\")","v":""},{"$f":"IF($AE9<>\"\",INDEX(INDIRECT(\"'\"&$AD9&\"'!$B$7:$I$100\"),$AE9,AI$2),\"\")","v":""},{"$f":"IF($AE9<>\"\",INDEX(INDIRECT(\"'\"&$AD9&\"'!$B$7:$I$100\"),$AE9,AJ$2),\"\")","v":""},{"$f":"IF($AE9<>\"\",INDEX(INDIRECT(\"'\"&$AD9&\"'!$B$7:$I$100\"),$AE9,AK$2),\"\")","v":""},{"$f":"IF($AE9<>\"\",INDEX(INDIRECT(\"'\"&$AD9&\"'!$B$7:$I$100\"),$AE9,AL$2),\"\")","v":""},{"$f":"IF($AE9<>\"\",INDEX(INDIRECT(\"'\"&$AD9&\"'!$B$7:$I$100\"),$AE9,AM$2),\"\")","v":""},{"$f":"IF($AE9<>\"\",INDEX(INDIRECT(\"'\"&$AD9&\"'!$B$7:$I$100\"),$AE9,AN$2),\"\")","v":""},null,null,null,null,null,null,null,null,null,null,null,{"$f":"IFERROR( INDIRECT(\"'\"&$W9&\"'!$B$4\"), \"\")","v":""},"S7","",false,{"$error":"#VALUE!"},"S7",{"$f":"IF(Y9=TRUE,COUNTA(INDIRECT(\"'\"&$W9&\"'!$B$7\"):INDIRECT(\"'\"&$W9&\"'!$B$64\")),\"\")","v":""},7,{"$f":"VLOOKUP(AC9,$Z$3:$AA47,2)","v":"S1"},""]
[null,"",{"$f":"IF($AE10<>\"\",INDEX(INDIRECT(\"'\"&$AD10&\"'!$B$7:$I$100\"),$AE10,AG$2),\"\")","v":""},{"$f":"IF($AE10<>\"\",INDEX(INDIRECT(\"'\"&$AD10&\"'!$B$7:$I$100\"),$AE10,AH$2),\"\")","v":""},{"$f":"IF($AE10<>\"\",INDEX(INDIRECT(\"'\"&$AD10&\"'!$B$7:$I$100\"),$AE10,AI$2),\"\")","v":""},{"$f":"IF($AE10<>\"\",INDEX(INDIRECT(\"'\"&$AD10&\"'!$B$7:$I$100\"),$AE10,AJ$2),\"\")","v":""},{"$f":"IF($AE10<>\"\",INDEX(INDIRECT(\"'\"&$AD10&\"'!$B$7:$I$100\"),$AE10,AK$2),\"\")","v":""},{"$f":"IF($AE10<>\"\",INDEX(INDIRECT(\"'\"&$AD10&\"'!$B$7:$I$100\"),$AE10,AL$2),\"\")","v":""},{"$f":"IF($AE10<>\"\",INDEX(INDIRECT(\"'\"&$AD10&\"'!$B$7:$I$100\"),$AE10,AM$2),\"\")","v":""},{"$f":"IF($AE10<>\"\",INDEX(INDIRECT(\"'\"&$AD10&\"'!$B$7:$I$100\"),$AE10,AN$2),\"\")","v":""},null,null,null,null,null,null,null,null,null,null,null,{"$f":"IFERROR( INDIRECT(\"'\"&$W10&\"'!$B$4\"), \"\")","v":""},"S8","",false,{"$error":"#VALUE!"},"S8",{"$f":"IF(Y10=TRUE,COUNTA(INDIRECT(\"'\"&$W10&\"'!$B$7\"):INDIRECT(\"'\"&$W10&\"'!$B$64\")),\"\")","v":""},8,{"$f":"VLOOKUP(AC10,$Z$3:$AA48,2)","v":"S1"},""]
[null,"",{"$f":"IF($AE11<>\"\",INDEX(INDIRECT(\"'\"&$AD11&\"'!$B$7:$I$100\"),$AE11,AG$2),\"\")","v":""},{"$f":"IF($AE11<>\"\",INDEX(INDIRECT(\"'\"&$AD11&\"'!$B$7:$I$100\"),$AE11,AH$2),\"\")","v":""},{"$f":"IF($AE11<>\"\",INDEX(INDIRECT(\"'\"&$AD11&\"'!$B$7:$I$100\"),$AE11,AI$2),\"\")","v":""},{"$f":"IF($AE11<>\"\",INDEX(INDIRECT(\"'\"&$AD11&\"'!$B$7:$I$100\"),$AE11,AJ$2),\"\")","v":""},{"$f":"IF($AE11<>\"\",INDEX(INDIRECT(\"'\"&$AD11&\"'!$B$7:$I$100\"),$AE11,AK$2),\"\")","v":""},{"$f":"IF($AE11<>\"\",INDEX(INDIRECT(\"'\"&$AD11&\"'!$B$7:$I$100\"),$AE11,AL$2),\"\")","v":""},{"$f":"IF($AE11<>\"\",INDEX(INDIRECT(\"'\"&$AD11&\"'!$B$7:$I$100\"),$AE11,AM$2),\"\")","v":""},{"$f":"IF($AE11<>\"\",INDEX(INDIRECT(\"'\"&$AD11&\"'!$B$7:$I$100\"),$AE11,AN$2),\"\")","v":""},null,null,null,null,null,null,null,null,null,null,null,{"$f":"IFERROR( INDIRECT(\"'\"&$W11&\"'!$B$4\"), \"\")","v":""},"S9","",false,{"$error":"#VALUE!"},"S9",{"$f":"IF(Y11=TRUE,COUNTA(INDIRECT(\"'\"&$W11&\"'!$B$7\"):INDIRECT(\"'\"&$W11&\"'!$B$64\")),\"\")","v":""},9,{"$f":"VLOOKUP(AC11,$Z$3:$AA49,2)","v":"S1"},""]
[null,"",{"$f":"IF($AE12<>\"\",INDEX(INDIRECT(\"'\"&$AD12&\"'!$B$7:$I$100\"),$AE12,AG$2),\"\")","v":""},{"$f":"IF($AE12<>\"\",INDEX(INDIRECT(\"'\"&$AD12&\"'!$B$7:$I$100\"),$AE12,AH$2),\"\")","v":""},{"$f":"IF($AE12<>\"\",INDEX(INDIRECT(\"'\"&$AD12&\"'!$B$7:$I$100\"),$AE12,AI$2),\"\")","v":""},{"$f":"IF($AE12<>\"\",INDEX(INDIRECT(\"'\"&$AD12&\"'!$B$7:$I$100\"),$AE12,AJ$2),\"\")","v":""},{"$f":"IF($AE12<>\"\",INDEX(INDIRECT(\"'\"&$AD12&\"'!$B$7:$I$100\"),$AE12,AK$2),\"\")","v":""},{"$f":"IF($AE12<>\"\",INDEX(INDIRECT(\"'\"&$AD12&\"'!$B$7:$I$100\"),$AE12,AL$2),\"\")","v":""},{"$f":"IF($AE12<>\"\",INDEX(INDIRECT(\"'\"&$AD12&\"'!$B$7:$I$100\"),$AE12,AM$2),\"\")","v":""},{"$f":"IF($AE12<>\"\",INDEX(INDIRECT(\"'\"&$AD12&\"'!$B$7:$I$100\"),$AE12,AN$2),\"\")","v":""},null,null,null,null,null,null,null,null,null,null,null,{"$f":"IFERROR( INDIRECT(\"'\"&$W12&\"'!$B$4\"), \"\")","v":""},"S10","",false,{"$error":"#VALUE!"},"S10",{"$f":"IF(Y12=TRUE,COUNTA(INDIRECT(\"'\"&$W12&\"'!$B$7\"):INDIRECT(\"'\"&$W12&\"'!$B$64\")),\"\")","v":""},10,{"$f":"VLOOKUP(AC12,$Z$3:$AA50,2)","v":"S1"},""]
[null,"",{"$f":"IF($AE13<>\"\",INDEX(INDIRECT(\"'\"&$AD13&\"'!$B$7:$I$100\"),$AE13,AG$2),\"\")","v":""},{"$f":"IF($AE13<>\"\",INDEX(INDIRECT(\"'\"&$AD13&\"'!$B$7:$I$100\"),$AE13,AH$2),\"\")","v":""},{"$f":"IF($AE13<>\"\",INDEX(INDIRECT(\"'\"&$AD13&\"'!$B$7:$I$100\"),$AE13,AI$2),\"\")","v":""},{"$f":"IF($AE13<>\"\",INDEX(INDIRECT(\"'\"&$AD13&\"'!$B$7:$I$100\"),$AE13,AJ$2),\"\")","v":""},{"$f":"IF($AE13<>\"\",INDEX(INDIRECT(\"'\"&$AD13&\"'!$B$7:$I$100\"),$AE13,AK$2),\"\")","v":""},{"$f":"IF($AE13<>\"\",INDEX(INDIRECT(\"'\"&$AD13&\"'!$B$7:$I$100\"),$AE13,AL$2),\"\")","v":""},{"$f":"IF($AE13<>\"\",INDEX(INDIRECT(\"'\"&$AD13&\"'!$B$7:$I$100\"),$AE13,AM$2),\"\")","v":""},{"$f":"IF($AE13<>\"\",INDEX(INDIRECT(\"'\"&$AD13&\"'!$B$7:$I$100\"),$AE13,AN$2),\"\")","v":""},null,null,null,null,null,null,null,null,null,null,null,{"$f":"IFERROR( INDIRECT(\"'\"&$W13&\"'!$B$4\"), \"\")","v":""},"S11","",false,{"$error":"#VALUE!"},"S11",{"$f":"IF(Y13=TRUE,COUNTA(INDIRECT(\"'\"&$W13&\"'!$B$7\"):INDIRECT(\"'\"&$W13&\"'!$B$64\")),\"\")","v":""},11,{"$f":"VLOOKUP(AC13,$Z$3:$AA51,2)","v":"S1"},""]
[null,"",{"$f":"IF($AE14<>\"\",INDEX(INDIRECT(\"'\"&$AD14&\"'!$B$7:$I$100\"),$AE14,AG$2),\"\")","v":""},{"$f":"IF($AE14<>\"\",INDEX(INDIRECT(\"'\"&$AD14&\"'!$B$7:$I$100\"),$AE14,AH$2),\"\")","v":""},{"$f":"IF($AE14<>\"\",INDEX(INDIRECT(\"'\"&$AD14&\"'!$B$7:$I$100\"),$AE14,AI$2),\"\")","v":""},{"$f":"IF($AE14<>\"\",INDEX(INDIRECT(\"'\"&$AD14&\"'!$B$7:$I$100\"),$AE14,AJ$2),\"\")","v":""},{"$f":"IF($AE14<>\"\",INDEX(INDIRECT(\"'\"&$AD14&\"'!$B$7:$I$100\"),$AE14,AK$2),\"\")","v":""},{"$f":"IF($AE14<>\"\",INDEX(INDIRECT(\"'\"&$AD14&\"'!$B$7:$I$100\"),$AE14,AL$2),\"\")","v":""},{"$f":"IF($AE14<>\"\",INDEX(INDIRECT(\"'\"&$AD14&\"'!$B$7:$I$100\"),$AE14,AM$2),\"\")","v":""},{"$f":"IF($AE14<>\"\",INDEX(INDIRECT(\"'\"&$AD14&\"'!$B$7:$I$100\"),$AE14,AN$2),\"\")","v":""},null,null,null,null,null,null,null,null,null,null,null,{"$f":"IFERROR( INDIRECT(\"'\"&$W14&\"'!$B$4\"), \"\")","v":""},"S12","",false,{"$error":"#VALUE!"},"S12",{"$f":"IF(Y14=TRUE,COUNTA(INDIRECT(\"'\"&$W14&\"'!$B$7\"):INDIRECT(\"'\"&$W14&\"'!$B$64\")),\"\")","v":""},12,{"$f":"VLOOKUP(AC14,$Z$3:$AA52,2)","v":"S1"},""]
[null,"",{"$f":"IF($AE15<>\"\",INDEX(INDIRECT(\"'\"&$AD15&\"'!$B$7:$I$100\"),$AE15,AG$2),\"\")","v":""},{"$f":"IF($AE15<>\"\",INDEX(INDIRECT(\"'\"&$AD15&\"'!$B$7:$I$100\"),$AE15,AH$2),\"\")","v":""},{"$f":"IF($AE15<>\"\",INDEX(INDIRECT(\"'\"&$AD15&\"'!$B$7:$I$100\"),$AE15,AI$2),\"\")","v":""},{"$f":"IF($AE15<>\"\",INDEX(INDIRECT(\"'\"&$AD15&\"'!$B$7:$I$100\"),$AE15,AJ$2),\"\")","v":""},{"$f":"IF($AE15<>\"\",INDEX(INDIRECT(\"'\"&$AD15&\"'!$B$7:$I$100\"),$AE15,AK$2),\"\")","v":""},{"$f":"IF($AE15<>\"\",INDEX(INDIRECT(\"'\"&$AD15&\"'!$B$7:$I$100\"),$AE15,AL$2),\"\")","v":""},{"$f":"IF($AE15<>\"\",INDEX(INDIRECT(\"'\"&$AD15&\"'!$B$7:$I$100\"),$AE15,AM$2),\"\")","v":""},{"$f":"IF($AE15<>\"\",INDEX(INDIRECT(\"'\"&$AD15&\"'!$B$7:$I$100\"),$AE15,AN$2),\"\")","v":""},null,null,null,null,null,null,null,null,null,null,null,{"$f":"IFERROR( INDIRECT(\"'\"&$W15&\"'!$B$4\"), \"\")","v":""},"S13","",false,{"$error":"#VALUE!"},"S13",{"$f":"IF(Y15=TRUE,COUNTA(INDIRECT(\"'\"&$W15&\"'!$B$7\"):INDIRECT(\"'\"&$W15&\"'!$B$64\")),\"\")","v":""},13,{"$f":"VLOOKUP(AC15,$Z$3:$AA53,2)","v":"S1"},""]
[null,"",{"$f":"IF($AE16<>\"\",INDEX(INDIRECT(\"'\"&$AD16&\"'!$B$7:$I$100\"),$AE16,AG$2),\"\")","v":""},{"$f":"IF($AE16<>\"\",INDEX(INDIRECT(\"'\"&$AD16&\"'!$B$7:$I$100\"),$AE16,AH$2),\"\")","v":""},{"$f":"IF($AE16<>\"\",INDEX(INDIRECT(\"'\"&$AD16&\"'!$B$7:$I$100\"),$AE16,AI$2),\"\")","v":""},{"$f":"IF($AE16<>\"\",INDEX(INDIRECT(\"'\"&$AD16&\"'!$B$7:$I$100\"),$AE16,AJ$2),\"\")","v":""},{"$f":"IF($AE16<>\"\",INDEX(INDIRECT(\"'\"&$AD16&\"'!$B$7:$I$100\"),$AE16,AK$2),\"\")","v":""},{"$f":"IF($AE16<>\"\",INDEX(INDIRECT(\"'\"&$AD16&\"'!$B$7:$I$100\"),$AE16,AL$2),\"\")","v":""},{"$f":"IF($AE16<>\"\",INDEX(INDIRECT(\"'\"&$AD16&\"'!$B$7:$I$100\"),$AE16,AM$2),\"\")","v":""},{"$f":"IF($AE16<>\"\",INDEX(INDIRECT(\"'\"&$AD16&\"'!$B$7:$I$100\"),$AE16,AN$2),\"\")","v":""},null,null,null,null,null,null,null,null,null,null,null,{"$f":"IFERROR( INDIRECT(\"'\"&$W16&\"'!$B$4\"), \"\")","v":""},"S14","",false,{"$error":"#VALUE!"},"S14",{"$f":"IF(Y16=TRUE,COUNTA(INDIRECT(\"'\"&$W16&\"'!$B$7\"):INDIRECT(\"'\"&$W16&\"'!$B$64\")),\"\")","v":""},14,{"$f":"VLOOKUP(AC16,$Z$3:$AA54,2)","v":"S1"},""]
[null,"",{"$f":"IF($AE17<>\"\",INDEX(INDIRECT(\"'\"&$AD17&\"'!$B$7:$I$100\"),$AE17,AG$2),\"\")","v":""},{"$f":"IF($AE17<>\"\",INDEX(INDIRECT(\"'\"&$AD17&\"'!$B$7:$I$100\"),$AE17,AH$2),\"\")","v":""},{"$f":"IF($AE17<>\"\",INDEX(INDIRECT(\"'\"&$AD17&\"'!$B$7:$I$100\"),$AE17,AI$2),\"\")","v":""},{"$f":"IF($AE17<>\"\",INDEX(INDIRECT(\"'\"&$AD17&\"'!$B$7:$I$100\"),$AE17,AJ$2),\"\")","v":""},{"$f":"IF($AE17<>\"\",INDEX(INDIRECT(\"'\"&$AD17&\"'!$B$7:$I$100\"),$AE17,AK$2),\"\")","v":""},{"$f":"IF($AE17<>\"\",INDEX(INDIRECT(\"'\"&$AD17&\"'!$B$7:$I$100\"),$AE17,AL$2),\"\")","v":""},{"$f":"IF($AE17<>\"\",INDEX(INDIRECT(\"'\"&$AD17&\"'!$B$7:$I$100\"),$AE17,AM$2),\"\")","v":""},{"$f":"IF($AE17<>\"\",INDEX(INDIRECT(\"'\"&$AD17&\"'!$B$7:$I$100\"),$AE17,AN$2),\"\")","v":""},null,null,null,null,null,null,null,null,null,null,null,{"$f":"IFERROR( INDIRECT(\"'\"&$W17&\"'!$B$4\"), \"\")","v":""},"S15","",false,{"$error":"#VALUE!"},"S15",{"$f":"IF(Y17=TRUE,COUNTA(INDIRECT(\"'\"&$W17&\"'!$B$7\"):INDIRECT(\"'\"&$W17&\"'!$B$64\")),\"\")","v":""},15,{"$f":"VLOOKUP(AC17,$Z$3:$AA55,2)","v":"S1"},""]
[null,"",{"$f":"IF($AE18<>\"\",INDEX(INDIRECT(\"'\"&$AD18&\"'!$B$7:$I$100\"),$AE18,AG$2),\"\")","v":""},{"$f":"IF($AE18<>\"\",INDEX(INDIRECT(\"'\"&$AD18&\"'!$B$7:$I$100\"),$AE18,AH$2),\"\")","v":""},{"$f":"IF($AE18<>\"\",INDEX(INDIRECT(\"'\"&$AD18&\"'!$B$7:$I$100\"),$AE18,AI$2),\"\")","v":""},{"$f":"IF($AE18<>\"\",INDEX(INDIRECT(\"'\"&$AD18&\"'!$B$7:$I$100\"),$AE18,AJ$2),\"\")","v":""},{"$f":"IF($AE18<>\"\",INDEX(INDIRECT(\"'\"&$AD18&\"'!$B$7:$I$100\"),$AE18,AK$2),\"\")","v":""},{"$f":"IF($AE18<>\"\",INDEX(INDIRECT(\"'\"&$AD18&\"'!$B$7:$I$100\"),$AE18,AL$2),\"\")","v":""},{"$f":"IF($AE18<>\"\",INDEX(INDIRECT(\"'\"&$AD18&\"'!$B$7:$I$100\"),$AE18,AM$2),\"\")","v":""},{"$f":"IF($AE18<>\"\",INDEX(INDIRECT(\"'\"&$AD18&\"'!$B$7:$I$100\"),$AE18,AN$2),\"\")","v":""},null,null,null,null,null,null,null,null,null,null,null,{"$f":"IFERROR( INDIRECT(\"'\"&$W18&\"'!$B$4\"), \"\")","v":""},"S16","",false,{"$error":"#VALUE!"},"S16",{"$f":"IF(Y18=TRUE,COUNTA(INDIRECT(\"'\"&$W18&\"'!$B$7\"):INDIRECT(\"'\"&$W18&\"'!$B$64\")),\"\")","v":""},16,{"$f":"VLOOKUP(AC18,$Z$3:$AA56,2)","v":"S1"},""]
[null,"",{"$f":"IF($AE19<>\"\",INDEX(INDIRECT(\"'\"&$AD19&\"'!$B$7:$I$100\"),$AE19,AG$2),\"\")","v":""},{"$f":"IF($AE19<>\"\",INDEX(INDIRECT(\"'\"&$AD19&\"'!$B$7:$I$100\"),$AE19,AH$2),\"\")","v":""},{"$f":"IF($AE19<>\"\",INDEX(INDIRECT(\"'\"&$AD19&\"'!$B$7:$I$100\"),$AE19,AI$2),\"\")","v":""},{"$f":"IF($AE19<>\"\",INDEX(INDIRECT(\"'\"&$AD19&\"'!$B$7:$I$100\"),$AE19,AJ$2),\"\")","v":""},{"$f":"IF($AE19<>\"\",INDEX(INDIRECT(\"'\"&$AD19&\"'!$B$7:$I$100\"),$AE19,AK$2),\"\")","v":""},{"$f":"IF($AE19<>\"\",INDEX(INDIRECT(\"'\"&$AD19&\"'!$B$7:$I$100\"),$AE19,AL$2),\"\")","v":""},{"$f":"IF($AE19<>\"\",INDEX(INDIRECT(\"'\"&$AD19&\"'!$B$7:$I$100\"),$AE19,AM$2),\"\")","v":""},{"$f":"IF($AE19<>\"\",INDEX(INDIRECT(\"'\"&$AD19&\"'!$B$7:$I$100\"),$AE19,AN$2),\"\")","v":""},null,null,null,null,null,null,null,null,null,null,null,{"$f":"IFERROR( INDIRECT(\"'\"&$W19&\"'!$B$4\"), \"\")","v":""},"S17","",false,{"$error":"#VALUE!"},"S17",{"$f":"IF(Y19=TRUE,COUNTA(INDIRECT(\"'\"&$W19&\"'!$B$7\"):INDIRECT(\"'\"&$W19&\"'!$B$64\")),\"\")","v":""},17,{"$f":"VLOOKUP(AC19,$Z$3:$AA57,2)","v":"S1"},""]
[null,"",{"$f":"IF($AE20<>\"\",INDEX(INDIRECT(\"'\"&$AD20&\"'!$B$7:$I$100\"),$AE20,AG$2),\"\")","v":""},{"$f":"IF($AE20<>\"\",INDEX(INDIRECT(\"'\"&$AD20&\"'!$B$7:$I$100\"),$AE20,AH$2),\"\")","v":""},{"$f":"IF($AE20<>\"\",INDEX(INDIRECT(\"'\"&$AD20&\"'!$B$7:$I$100\"),$AE20,AI$2),\"\")","v":""},{"$f":"IF($AE20<>\"\",INDEX(INDIRECT(\"'\"&$AD20&\"'!$B$7:$I$100\"),$AE20,AJ$2),\"\")","v":""},{"$f":"IF($AE20<>\"\",INDEX(INDIRECT(\"'\"&$AD20&\"'!$B$7:$I$100\"),$AE20,AK$2),\"\")","v":""},{"$f":"IF($AE20<>\"\",INDEX(INDIRECT(\"'\"&$AD20&\"'!$B$7:$I$100\"),$AE20,AL$2),\"\")","v":""},{"$f":"IF($AE20<>\"\",INDEX(INDIRECT(\"'\"&$AD20&\"'!$B$7:$I$100\"),$AE20,AM$2),\"\")","v":""},{"$f":"IF($AE20<>\"\",INDEX(INDIRECT(\"'\"&$AD20&\"'!$B$7:$I$100\"),$AE20,AN$2),\"\")","v":""},null,null,null,null,null,null,null,null,null,null,null,{"$f":"IFERROR( INDIRECT(\"'\"&$W20&\"'!$B$4\"), \"\")","v":""},"S18","",false,{"$error":"#VALUE!"},"S18",{"$f":"IF(Y20=TRUE,COUNTA(INDIRECT(\"'\"&$W20&\"'!$B$7\"):INDIRECT(\"'\"&$W20&\"'!$B$64\")),\"\")","v":""},18,{"$f":"VLOOKUP(AC20,$Z$3:$AA58,2)","v":"S1"},""]
[null,"",{"$f":"IF($AE21<>\"\",INDEX(INDIRECT(\"'\"&$AD21&\"'!$B$7:$I$100\"),$AE21,AG$2),\"\")","v":""},{"$f":"IF($AE21<>\"\",INDEX(INDIRECT(\"'\"&$AD21&\"'!$B$7:$I$100\"),$AE21,AH$2),\"\")","v":""},{"$f":"IF($AE21<>\"\",INDEX(INDIRECT(\"'\"&$AD21&\"'!$B$7:$I$100\"),$AE21,AI$2),\"\")","v":""},{"$f":"IF($AE21<>\"\",INDEX(INDIRECT(\"'\"&$AD21&\"'!$B$7:$I$100\"),$AE21,AJ$2),\"\")","v":""},{"$f":"IF($AE21<>\"\",INDEX(INDIRECT(\"'\"&$AD21&\"'!$B$7:$I$100\"),$AE21,AK$2),\"\")","v":""},{"$f":"IF($AE21<>\"\",INDEX(INDIRECT(\"'\"&$AD21&\"'!$B$7:$I$100\"),$AE21,AL$2),\"\")","v":""},{"$f":"IF($AE21<>\"\",INDEX(INDIRECT(\"'\"&$AD21&\"'!$B$7:$I$100\"),$AE21,AM$2),\"\")","v":""},{"$f":"IF($AE21<>\"\",INDEX(INDIRECT(\"'\"&$AD21&\"'!$B$7:$I$100\"),$AE21,AN$2),\"\")","v":""},null,null,null,null,null,null,null,null,null,null,null,{"$f":"IFERROR( INDIRECT(\"'\"&$W21&\"'!$B$4\"), \"\")","v":""},"S19","",false,{"$error":"#VALUE!"},"S19",{"$f":"IF(Y21=TRUE,COUNTA(INDIRECT(\"'\"&$W21&\"'!$B$7\"):INDIRECT(\"'\"&$W21&\"'!$B$64\")),\"\")","v":""},19,{"$f":"VLOOKUP(AC21,$Z$3:$AA59,2)","v":"S1"},""]
[null,"",{"$f":"IF($AE22<>\"\",INDEX(INDIRECT(\"'\"&$AD22&\"'!$B$7:$I$100\"),$AE22,AG$2),\"\")","v":""},{"$f":"IF($AE22<>\"\",INDEX(INDIRECT(\"'\"&$AD22&\"'!$B$7:$I$100\"),$AE22,AH$2),\"\")","v":""},{"$f":"IF($AE22<>\"\",INDEX(INDIRECT(\"'\"&$AD22&\"'!$B$7:$I$100\"),$AE22,AI$2),\"\")","v":""},{"$f":"IF($AE22<>\"\",INDEX(INDIRECT(\"'\"&$AD22&\"'!$B$7:$I$100\"),$AE22,AJ$2),\"\")","v":""},{"$f":"IF($AE22<>\"\",INDEX(INDIRECT(\"'\"&$AD22&\"'!$B$7:$I$100\"),$AE22,AK$2),\"\")","v":""},{"$f":"IF($AE22<>\"\",INDEX(INDIRECT(\"'\"&$AD22&\"'!$B$7:$I$100\"),$AE22,AL$2),\"\")","v":""},{"$f":"IF($AE22<>\"\",INDEX(INDIRECT(\"'\"&$AD22&\"'!$B$7:$I$100\"),$AE22,AM$2),\"\")","v":""},{"$f":"IF($AE22<>\"\",INDEX(INDIRECT(\"'\"&$AD22&\"'!$B$7:$I$100\"),$AE22,AN$2),\"\")","v":""},null,null,null,null,null,null,null,null,null,null,null,{"$f":"IFERROR( INDIRECT(\"'\"&$W22&\"'!$B$4\"), \"\")","v":""},"S20","",false,{"$error":"#VALUE!"},"S20",{"$f":"IF(Y22=TRUE,COUNTA(INDIRECT(\"'\"&$W22&\"'!$B$7\"):INDIRECT(\"'\"&$W22&\"'!$B$64\")),\"\")","v":""},20,{"$f":"VLOOKUP(AC22,$Z$3:$AA60,2)","v":"S1"},""]
[null,"",{"$f":"IF($AE23<>\"\",INDEX(INDIRECT(\"'\"&$AD23&\"'!$B$7:$I$100\"),$AE23,AG$2),\"\")","v":""},{"$f":"IF($AE23<>\"\",INDEX(INDIRECT(\"'\"&$AD23&\"'!$B$7:$I$100\"),$AE23,AH$2),\"\")","v":""},{"$f":"IF($AE23<>\"\",INDEX(INDIRECT(\"'\"&$AD23&\"'!$B$7:$I$100\"),$AE23,AI$2),\"\")","v":""},{"$f":"IF($AE23<>\"\",INDEX(INDIRECT(\"'\"&$AD23&\"'!$B$7:$I$100\"),$AE23,AJ$2),\"\")","v":""},{"$f":"IF($AE23<>\"\",INDEX(INDIRECT(\"'\"&$AD23&\"'!$B$7:$I$100\"),$AE23,AK$2),\"\")","v":""},{"$f":"IF($AE23<>\"\",INDEX(INDIRECT(\"'\"&$AD23&\"'!$B$7:$I$100\"),$AE23,AL$2),\"\")","v":""},{"$f":"IF($AE23<>\"\",INDEX(INDIRECT(\"'\"&$AD23&\"'!$B$7:$I$100\"),$AE23,AM$2),\"\")","v":""},{"$f":"IF($AE23<>\"\",INDEX(INDIRECT(\"'\"&$AD23&\"'!$B$7:$I$100\"),$AE23,AN$2),\"\")","v":""},null,null,null,null,null,null,null,null,null,null,null,{"$f":"IFERROR( INDIRECT(\"'\"&$W23&\"'!$B$4\"), \"\")","v":""},"S21","",false,{"$error":"#VALUE!"},"S21",{"$f":"IF(Y23=TRUE,COUNTA(INDIRECT(\"'\"&$W23&\"'!$B$7\"):INDIRECT(\"'\"&$W23&\"'!$B$64\")),\"\")","v":""},21,{"$f":"VLOOKUP(AC23,$Z$3:$AA61,2)","v":"S1"},""]
[null,"",{"$f":"IF($AE24<>\"\",INDEX(INDIRECT(\"'\"&$AD24&\"'!$B$7:$I$100\"),$AE24,AG$2),\"\")","v":""},{"$f":"IF($AE24<>\"\",INDEX(INDIRECT(\"'\"&$AD24&\"'!$B$7:$I$100\"),$AE24,AH$2),\"\")","v":""},{"$f":"IF($AE24<>\"\",INDEX(INDIRECT(\"'\"&$AD24&\"'!$B$7:$I$100\"),$AE24,AI$2),\"\")","v":""},{"$f":"IF($AE24<>\"\",INDEX(INDIRECT(\"'\"&$AD24&\"'!$B$7:$I$100\"),$AE24,AJ$2),\"\")","v":""},{"$f":"IF($AE24<>\"\",INDEX(INDIRECT(\"'\"&$AD24&\"'!$B$7:$I$100\"),$AE24,AK$2),\"\")","v":""},{"$f":"IF($AE24<>\"\",INDEX(INDIRECT(\"'\"&$AD24&\"'!$B$7:$I$100\"),$AE24,AL$2),\"\")","v":""},{"$f":"IF($AE24<>\"\",INDEX(INDIRECT(\"'\"&$AD24&\"'!$B$7:$I$100\"),$AE24,AM$2),\"\")","v":""},{"$f":"IF($AE24<>\"\",INDEX(INDIRECT(\"'\"&$AD24&\"'!$B$7:$I$100\"),$AE24,AN$2),\"\")","v":""},null,null,null,null,null,null,null,null,null,null,null,{"$f":"IFERROR( INDIRECT(\"'\"&$W24&\"'!$B$4\"), \"\")","v":""},"S22","",false,{"$error":"#VALUE!"},"S22",{"$f":"IF(Y24=TRUE,COUNTA(INDIRECT(\"'\"&$W24&\"'!$B$7\"):INDIRECT(\"'\"&$W24&\"'!$B$64\")),\"\")","v":""},22,{"$f":"VLOOKUP(AC24,$Z$3:$AA62,2)","v":"S1"},""]
[null,"",{"$f":"IF($AE25<>\"\",INDEX(INDIRECT(\"'\"&$AD25&\"'!$B$7:$I$100\"),$AE25,AG$2),\"\")","v":""},{"$f":"IF($AE25<>\"\",INDEX(INDIRECT(\"'\"&$AD25&\"'!$B$7:$I$100\"),$AE25,AH$2),\"\")","v":""},{"$f":"IF($AE25<>\"\",INDEX(INDIRECT(\"'\"&$AD25&\"'!$B$7:$I$100\"),$AE25,AI$2),\"\")","v":""},{"$f":"IF($AE25<>\"\",INDEX(INDIRECT(\"'\"&$AD25&\"'!$B$7:$I$100\"),$AE25,AJ$2),\"\")","v":""},{"$f":"IF($AE25<>\"\",INDEX(INDIRECT(\"'\"&$AD25&\"'!$B$7:$I$100\"),$AE25,AK$2),\"\")","v":""},{"$f":"IF($AE25<>\"\",INDEX(INDIRECT(\"'\"&$AD25&\"'!$B$7:$I$100\"),$AE25,AL$2),\"\")","v":""},{"$f":"IF($AE25<>\"\",INDEX(INDIRECT(\"'\"&$AD25&\"'!$B$7:$I$100\"),$AE25,AM$2),\"\")","v":""},{"$f":"IF($AE25<>\"\",INDEX(INDIRECT(\"'\"&$AD25&\"'!$B$7:$I$100\"),$AE25,AN$2),\"\")","v":""},null,null,null,null,null,null,null,null,null,null,null,{"$f":"IFERROR( INDIRECT(\"'\"&$W25&\"'!$B$4\"), \"\")","v":""},"S23","",false,{"$error":"#VALUE!"},"S23",{"$f":"IF(Y25=TRUE,COUNTA(INDIRECT(\"'\"&$W25&\"'!$B$7\"):INDIRECT(\"'\"&$W25&\"'!$B$64\")),\"\")","v":""},23,{"$f":"VLOOKUP(AC25,$Z$3:$AA63,2)","v":"S1"},""]
[null,"",{"$f":"IF($AE26<>\"\",INDEX(INDIRECT(\"'\"&$AD26&\"'!$B$7:$I$100\"),$AE26,AG$2),\"\")","v":""},{"$f":"IF($AE26<>\"\",INDEX(INDIRECT(\"'\"&$AD26&\"'!$B$7:$I$100\"),$AE26,AH$2),\"\")","v":""},{"$f":"IF($AE26<>\"\",INDEX(INDIRECT(\"'\"&$AD26&\"'!$B$7:$I$100\"),$AE26,AI$2),\"\")","v":""},{"$f":"IF($AE26<>\"\",INDEX(INDIRECT(\"'\"&$AD26&\"'!$B$7:$I$100\"),$AE26,AJ$2),\"\")","v":""},{"$f":"IF($AE26<>\"\",INDEX(INDIRECT(\"'\"&$AD26&\"'!$B$7:$I$100\"),$AE26,AK$2),\"\")","v":""},{"$f":"IF($AE26<>\"\",INDEX(INDIRECT(\"'\"&$AD26&\"'!$B$7:$I$100\"),$AE26,AL$2),\"\")","v":""},{"$f":"IF($AE26<>\"\",INDEX(INDIRECT(\"'\"&$AD26&\"'!$B$7:$I$100\"),$AE26,AM$2),\"\")","v":""},{"$f":"IF($AE26<>\"\",INDEX(INDIRECT(\"'\"&$AD26&\"'!$B$7:$I$100\"),$AE26,AN$2),\"\")","v":""},null,null,null,null,null,null,null,null,null,null,null,{"$f":"IFERROR( INDIRECT(\"'\"&$W26&\"'!$B$4\"), \"\")","v":""},"S24","",false,{"$error":"#VALUE!"},"S24",{"$f":"IF(Y26=TRUE,COUNTA(INDIRECT(\"'\"&$W26&\"'!$B$7\"):INDIRECT(\"'\"&$W26&\"'!$B$64\")),\"\")","v":""},24,{"$f":"VLOOKUP(AC26,$Z$3:$AA64,2)","v":"S1"},""]
[null,"",{"$f":"IF($AE27<>\"\",INDEX(INDIRECT(\"'\"&$AD27&\"'!$B$7:$I$100\"),$AE27,AG$2),\"\")","v":""},{"$f":"IF($AE27<>\"\",INDEX(INDIRECT(\"'\"&$AD27&\"'!$B$7:$I$100\"),$AE27,AH$2),\"\")","v":""},{"$f":"IF($AE27<>\"\",INDEX(INDIRECT(\"'\"&$AD27&\"'!$B$7:$I$100\"),$AE27,AI$2),\"\")","v":""},{"$f":"IF($AE27<>\"\",INDEX(INDIRECT(\"'\"&$AD27&\"'!$B$7:$I$100\"),$AE27,AJ$2),\"\")","v":""},{"$f":"IF($AE27<>\"\",INDEX(INDIRECT(\"'\"&$AD27&\"'!$B$7:$I$100\"),$AE27,AK$2),\"\")","v":""},{"$f":"IF($AE27<>\"\",INDEX(INDIRECT(\"'\"&$AD27&\"'!$B$7:$I$100\"),$AE27,AL$2),\"\")","v":""},{"$f":"IF($AE27<>\"\",INDEX(INDIRECT(\"'\"&$AD27&\"'!$B$7:$I$100\"),$AE27,AM$2),\"\")","v":""},{"$f":"IF($AE27<>\"\",INDEX(INDIRECT(\"'\"&$AD27&\"'!$B$7:$I$100\"),$AE27,AN$2),\"\")","v":""},null,null,null,null,null,null,null,null,null,null,null,{"$f":"IFERROR( INDIRECT(\"'\"&$W27&\"'!$B$4\"), \"\")","v":""},"S25","",false,{"$error":"#VALUE!"},"S25",{"$f":"IF(Y27=TRUE,COUNTA(INDIRECT(\"'\"&$W27&\"'!$B$7\"):INDIRECT(\"'\"&$W27&\"'!$B$64\")),\"\")","v":""},25,{"$f":"VLOOKUP(AC27,$Z$3:$AA65,2)","v":"S1"},""]
[null,"",{"$f":"IF($AE28<>\"\",INDEX(INDIRECT(\"'\"&$AD28&\"'!$B$7:$I$100\"),$AE28,AG$2),\"\")","v":""},{"$f":"IF($AE28<>\"\",INDEX(INDIRECT(\"'\"&$AD28&\"'!$B$7:$I$100\"),$AE28,AH$2),\"\")","v":""},{"$f":"IF($AE28<>\"\",INDEX(INDIRECT(\"'\"&$AD28&\"'!$B$7:$I$100\"),$AE28,AI$2),\"\")","v":""},{"$f":"IF($AE28<>\"\",INDEX(INDIRECT(\"'\"&$AD28&\"'!$B$7:$I$100\"),$AE28,AJ$2),\"\")","v":""},{"$f":"IF($AE28<>\"\",INDEX(INDIRECT(\"'\"&$AD28&\"'!$B$7:$I$100\"),$AE28,AK$2),\"\")","v":""},{"$f":"IF($AE28<>\"\",INDEX(INDIRECT(\"'\"&$AD28&\"'!$B$7:$I$100\"),$AE28,AL$2),\"\")","v":""},{"$f":"IF($AE28<>\"\",INDEX(INDIRECT(\"'\"&$AD28&\"'!$B$7:$I$100\"),$AE28,AM$2),\"\")","v":""},{"$f":"IF($AE28<>\"\",INDEX(INDIRECT(\"'\"&$AD28&\"'!$B$7:$I$100\"),$AE28,AN$2),\"\")","v":""},null,null,null,null,null,null,null,null,null,null,null,{"$f":"IFERROR( INDIRECT(\"'\"&$W28&\"'!$B$4\"), \"\")","v":""},"S26","",false,{"$error":"#VALUE!"},"S26",{"$f":"IF(Y28=TRUE,COUNTA(INDIRECT(\"'\"&$W28&\"'!$B$7\"):INDIRECT(\"'\"&$W28&\"'!$B$64\")),\"\")","v":""},26,{"$f":"VLOOKUP(AC28,$Z$3:$AA66,2)","v":"S1"},""]
[null,"",{"$f":"IF($AE29<>\"\",INDEX(INDIRECT(\"'\"&$AD29&\"'!$B$7:$I$100\"),$AE29,AG$2),\"\")","v":""},{"$f":"IF($AE29<>\"\",INDEX(INDIRECT(\"'\"&$AD29&\"'!$B$7:$I$100\"),$AE29,AH$2),\"\")","v":""},{"$f":"IF($AE29<>\"\",INDEX(INDIRECT(\"'\"&$AD29&\"'!$B$7:$I$100\"),$AE29,AI$2),\"\")","v":""},{"$f":"IF($AE29<>\"\",INDEX(INDIRECT(\"'\"&$AD29&\"'!$B$7:$I$100\"),$AE29,AJ$2),\"\")","v":""},{"$f":"IF($AE29<>\"\",INDEX(INDIRECT(\"'\"&$AD29&\"'!$B$7:$I$100\"),$AE29,AK$2),\"\")","v":""},{"$f":"IF($AE29<>\"\",INDEX(INDIRECT(\"'\"&$AD29&\"'!$B$7:$I$100\"),$AE29,AL$2),\"\")","v":""},{"$f":"IF($AE29<>\"\",INDEX(INDIRECT(\"'\"&$AD29&\"'!$B$7:$I$100\"),$AE29,AM$2),\"\")","v":""},{"$f":"IF($AE29<>\"\",INDEX(INDIRECT(\"'\"&$AD29&\"'!$B$7:$I$100\"),$AE29,AN$2),\"\")","v":""},null,null,null,null,null,null,null,null,null,null,null,{"$f":"IFERROR( INDIRECT(\"'\"&$W29&\"'!$B$4\"), \"\")","v":""},"S27","",false,{"$error":"#VALUE!"},"S27",{"$f":"IF(Y29=TRUE,COUNTA(INDIRECT(\"'\"&$W29&\"'!$B$7\"):INDIRECT(\"'\"&$W29&\"'!$B$64\")),\"\")","v":""},27,{"$f":"VLOOKUP(AC29,$Z$3:$AA67,2)","v":"S1"},""]
[null,"",{"$f":"IF($AE30<>\"\",INDEX(INDIRECT(\"'\"&$AD30&\"'!$B$7:$I$100\"),$AE30,AG$2),\"\")","v":""},{"$f":"IF($AE30<>\"\",INDEX(INDIRECT(\"'\"&$AD30&\"'!$B$7:$I$100\"),$AE30,AH$2),\"\")","v":""},{"$f":"IF($AE30<>\"\",INDEX(INDIRECT(\"'\"&$AD30&\"'!$B$7:$I$100\"),$AE30,AI$2),\"\")","v":""},{"$f":"IF($AE30<>\"\",INDEX(INDIRECT(\"'\"&$AD30&\"'!$B$7:$I$100\"),$AE30,AJ$2),\"\")","v":""},{"$f":"IF($AE30<>\"\",INDEX(INDIRECT(\"'\"&$AD30&\"'!$B$7:$I$100\"),$AE30,AK$2),\"\")","v":""},{"$f":"IF($AE30<>\"\",INDEX(INDIRECT(\"'\"&$AD30&\"'!$B$7:$I$100\"),$AE30,AL$2),\"\")","v":""},{"$f":"IF($AE30<>\"\",INDEX(INDIRECT(\"'\"&$AD30&\"'!$B$7:$I$100\"),$AE30,AM$2),\"\")","v":""},{"$f":"IF($AE30<>\"\",INDEX(INDIRECT(\"'\"&$AD30&\"'!$B$7:$I$100\"),$AE30,AN$2),\"\")","v":""},null,null,null,null,null,null,null,null,null,null,null,{"$f":"IFERROR( INDIRECT(\"'\"&$W30&\"'!$B$4\"), \"\")","v":""},"S28","",false,{"$error":"#VALUE!"},"S28",{"$f":"IF(Y30=TRUE,COUNTA(INDIRECT(\"'\"&$W30&\"'!$B$7\"):INDIRECT(\"'\"&$W30&\"'!$B$64\")),\"\")","v":""},28,{"$f":"VLOOKUP(AC30,$Z$3:$AA68,2)","v":"S1"},""]
[null,"",{"$f":"IF($AE31<>\"\",INDEX(INDIRECT(\"'\"&$AD31&\"'!$B$7:$I$100\"),$AE31,AG$2),\"\")","v":""},{"$f":"IF($AE31<>\"\",INDEX(INDIRECT(\"'\"&$AD31&\"'!$B$7:$I$100\"),$AE31,AH$2),\"\")","v":""},{"$f":"IF($AE31<>\"\",INDEX(INDIRECT(\"'\"&$AD31&\"'!$B$7:$I$100\"),$AE31,AI$2),\"\")","v":""},{"$f":"IF($AE31<>\"\",INDEX(INDIRECT(\"'\"&$AD31&\"'!$B$7:$I$100\"),$AE31,AJ$2),\"\")","v":""},{"$f":"IF($AE31<>\"\",INDEX(INDIRECT(\"'\"&$AD31&\"'!$B$7:$I$100\"),$AE31,AK$2),\"\")","v":""},{"$f":"IF($AE31<>\"\",INDEX(INDIRECT(\"'\"&$AD31&\"'!$B$7:$I$100\"),$AE31,AL$2),\"\")","v":""},{"$f":"IF($AE31<>\"\",INDEX(INDIRECT(\"'\"&$AD31&\"'!$B$7:$I$100\"),$AE31,AM$2),\"\")","v":""},{"$f":"IF($AE31<>\"\",INDEX(INDIRECT(\"'\"&$AD31&\"'!$B$7:$I$100\"),$AE31,AN$2),\"\")","v":""},null,null,null,null,null,null,null,null,null,null,null,{"$f":"IFERROR( INDIRECT(\"'\"&$W31&\"'!$B$4\"), \"\")","v":""},"S29","",false,{"$error":"#VALUE!"},"S29",{"$f":"IF(Y31=TRUE,COUNTA(INDIRECT(\"'\"&$W31&\"'!$B$7\"):INDIRECT(\"'\"&$W31&\"'!$B$64\")),\"\")","v":""},29,{"$f":"VLOOKUP(AC31,$Z$3:$AA69,2)","v":"S1"},""]
[null,"",{"$f":"IF($AE32<>\"\",INDEX(INDIRECT(\"'\"&$AD32&\"'!$B$7:$I$100\"),$AE32,AG$2),\"\")","v":""},{"$f":"IF($AE32<>\"\",INDEX(INDIRECT(\"'\"&$AD32&\"'!$B$7:$I$100\"),$AE32,AH$2),\"\")","v":""},{"$f":"IF($AE32<>\"\",INDEX(INDIRECT(\"'\"&$AD32&\"'!$B$7:$I$100\"),$AE32,AI$2),\"\")","v":""},{"$f":"IF($AE32<>\"\",INDEX(INDIRECT(\"'\"&$AD32&\"'!$B$7:$I$100\"),$AE32,AJ$2),\"\")","v":""},{"$f":"IF($AE32<>\"\",INDEX(INDIRECT(\"'\"&$AD32&\"'!$B$7:$I$100\"),$AE32,AK$2),\"\")","v":""},{"$f":"IF($AE32<>\"\",INDEX(INDIRECT(\"'\"&$AD32&\"'!$B$7:$I$100\"),$AE32,AL$2),\"\")","v":""},{"$f":"IF($AE32<>\"\",INDEX(INDIRECT(\"'\"&$AD32&\"'!$B$7:$I$100\"),$AE32,AM$2),\"\")","v":""},{"$f":"IF($AE32<>\"\",INDEX(INDIRECT(\"'\"&$AD32&\"'!$B$7:$I$100\"),$AE32,AN$2),\"\")","v":""},null,null,null,null,null,null,null,null,null,null,null,{"$f":"IFERROR( INDIRECT(\"'\"&$W32&\"'!$B$4\"), \"\")","v":""},"S30","",false,{"$error":"#VALUE!"},"S30",{"$f":"IF(Y32=TRUE,COUNTA(INDIRECT(\"'\"&$W32&\"'!$B$7\"):INDIRECT(\"'\"&$W32&\"'!$B$64\")),\"\")","v":""},30,{"$f":"VLOOKUP(AC32,$Z$3:$AA70,2)","v":"S1"},""]
[null,"",{"$f":"IF($AE33<>\"\",INDEX(INDIRECT(\"'\"&$AD33&\"'!$B$7:$I$100\"),$AE33,AG$2),\"\")","v":""},{"$f":"IF($AE33<>\"\",INDEX(INDIRECT(\"'\"&$AD33&\"'!$B$7:$I$100\"),$AE33,AH$2),\"\")","v":""},{"$f":"IF($AE33<>\"\",INDEX(INDIRECT(\"'\"&$AD33&\"'!$B$7:$I$100\"),$AE33,AI$2),\"\")","v":""},{"$f":"IF($AE33<>\"\",INDEX(INDIRECT(\"'\"&$AD33&\"'!$B$7:$I$100\"),$AE33,AJ$2),\"\")","v":""},{"$f":"IF($AE33<>\"\",INDEX(INDIRECT(\"'\"&$AD33&\"'!$B$7:$I$100\"),$AE33,AK$2),\"\")","v":""},{"$f":"IF($AE33<>\"\",INDEX(INDIRECT(\"'\"&$AD33&\"'!$B$7:$I$100\"),$AE33,AL$2),\"\")","v":""},{"$f":"IF($AE33<>\"\",INDEX(INDIRECT(\"'\"&$AD33&\"'!$B$7:$I$100\"),$AE33,AM$2),\"\")","v":""},{"$f":"IF($AE33<>\"\",INDEX(INDIRECT(\"'\"&$AD33&\"'!$B$7:$I$100\"),$AE33,AN$2),\"\")","v":""},null,null,null,null,null,null,null,null,null,null,null,{"$f":"IFERROR( INDIRECT(\"'\"&$W33&\"'!$B$4\"), \"\")","v":""},"S31","",false,{"$error":"#VALUE!"},"S31",{"$f":"IF(Y33=TRUE,COUNTA(INDIRECT(\"'\"&$W33&\"'!$B$7\"):INDIRECT(\"'\"&$W33&\"'!$B$64\")),\"\")","v":""},31,{"$f":"VLOOKUP(AC33,$Z$3:$AA71,2)","v":"S1"},""]
[null,"",{"$f":"IF($AE34<>\"\",INDEX(INDIRECT(\"'\"&$AD34&\"'!$B$7:$I$100\"),$AE34,AG$2),\"\")","v":""},{"$f":"IF($AE34<>\"\",INDEX(INDIRECT(\"'\"&$AD34&\"'!$B$7:$I$100\"),$AE34,AH$2),\"\")","v":""},{"$f":"IF($AE34<>\"\",INDEX(INDIRECT(\"'\"&$AD34&\"'!$B$7:$I$100\"),$AE34,AI$2),\"\")","v":""},{"$f":"IF($AE34<>\"\",INDEX(INDIRECT(\"'\"&$AD34&\"'!$B$7:$I$100\"),$AE34,AJ$2),\"\")","v":""},{"$f":"IF($AE34<>\"\",INDEX(INDIRECT(\"'\"&$AD34&\"'!$B$7:$I$100\"),$AE34,AK$2),\"\")","v":""},{"$f":"IF($AE34<>\"\",INDEX(INDIRECT(\"'\"&$AD34&\"'!$B$7:$I$100\"),$AE34,AL$2),\"\")","v":""},{"$f":"IF($AE34<>\"\",INDEX(INDIRECT(\"'\"&$AD34&\"'!$B$7:$I$100\"),$AE34,AM$2),\"\")","v":""},{"$f":"IF($AE34<>\"\",INDEX(INDIRECT(\"'\"&$AD34&\"'!$B$7:$I$100\"),$AE34,AN$2),\"\")","v":""},null,null,null,null,null,null,null,null,null,null,null,{"$f":"IFERROR( INDIRECT(\"'\"&$W34&\"'!$B$4\"), \"\")","v":""},"S32","",false,{"$error":"#VALUE!"},"S32",{"$f":"IF(Y34=TRUE,COUNTA(INDIRECT(\"'\"&$W34&\"'!$B$7\"):INDIRECT(\"'\"&$W34&\"'!$B$64\")),\"\")","v":""},32,{"$f":"VLOOKUP(AC34,$Z$3:$AA72,2)","v":"S1"},""]
[null,"",{"$f":"IF($AE35<>\"\",INDEX(INDIRECT(\"'\"&$AD35&\"'!$B$7:$I$100\"),$AE35,AG$2),\"\")","v":""},{"$f":"IF($AE35<>\"\",INDEX(INDIRECT(\"'\"&$AD35&\"'!$B$7:$I$100\"),$AE35,AH$2),\"\")","v":""},{"$f":"IF($AE35<>\"\",INDEX(INDIRECT(\"'\"&$AD35&\"'!$B$7:$I$100\"),$AE35,AI$2),\"\")","v":""},{"$f":"IF($AE35<>\"\",INDEX(INDIRECT(\"'\"&$AD35&\"'!$B$7:$I$100\"),$AE35,AJ$2),\"\")","v":""},{"$f":"IF($AE35<>\"\",INDEX(INDIRECT(\"'\"&$AD35&\"'!$B$7:$I$100\"),$AE35,AK$2),\"\")","v":""},{"$f":"IF($AE35<>\"\",INDEX(INDIRECT(\"'\"&$AD35&\"'!$B$7:$I$100\"),$AE35,AL$2),\"\")","v":""},{"$f":"IF($AE35<>\"\",INDEX(INDIRECT(\"'\"&$AD35&\"'!$B$7:$I$100\"),$AE35,AM$2),\"\")","v":""},{"$f":"IF($AE35<>\"\",INDEX(INDIRECT(\"'\"&$AD35&\"'!$B$7:$I$100\"),$AE35,AN$2),\"\")","v":""},null,null,null,null,null,null,null,null,null,null,null,{"$f":"IFERROR( INDIRECT(\"'\"&$W35&\"'!$B$4\"), \"\")","v":""},"S33","",false,{"$error":"#VALUE!"},"S33",{"$f":"IF(Y35=TRUE,COUNTA(INDIRECT(\"'\"&$W35&\"'!$B$7\"):INDIRECT(\"'\"&$W35&\"'!$B$64\")),\"\")","v":""},33,{"$f":"VLOOKUP(AC35,$Z$3:$AA73,2)","v":"S1"},""]
[null,"",{"$f":"IF($AE36<>\"\",INDEX(INDIRECT(\"'\"&$AD36&\"'!$B$7:$I$100\"),$AE36,AG$2),\"\")","v":""},{"$f":"IF($AE36<>\"\",INDEX(INDIRECT(\"'\"&$AD36&\"'!$B$7:$I$100\"),$AE36,AH$2),\"\")","v":""},{"$f":"IF($AE36<>\"\",INDEX(INDIRECT(\"'\"&$AD36&\"'!$B$7:$I$100\"),$AE36,AI$2),\"\")","v":""},{"$f":"IF($AE36<>\"\",INDEX(INDIRECT(\"'\"&$AD36&\"'!$B$7:$I$100\"),$AE36,AJ$2),\"\")","v":""},{"$f":"IF($AE36<>\"\",INDEX(INDIRECT(\"'\"&$AD36&\"'!$B$7:$I$100\"),$AE36,AK$2),\"\")","v":""},{"$f":"IF($AE36<>\"\",INDEX(INDIRECT(\"'\"&$AD36&\"'!$B$7:$I$100\"),$AE36,AL$2),\"\")","v":""},{"$f":"IF($AE36<>\"\",INDEX(INDIRECT(\"'\"&$AD36&\"'!$B$7:$I$100\"),$AE36,AM$2),\"\")","v":""},{"$f":"IF($AE36<>\"\",INDEX(INDIRECT(\"'\"&$AD36&\"'!$B$7:$I$100\"),$AE36,AN$2),\"\")","v":""},null,null,null,null,null,null,null,null,null,null,null,{"$f":"IFERROR( INDIRECT(\"'\"&$W36&\"'!$B$4\"), \"\")","v":""},"S34","",false,{"$error":"#VALUE!"},"S34",{"$f":"IF(Y36=TRUE,COUNTA(INDIRECT(\"'\"&$W36&\"'!$B$7\"):INDIRECT(\"'\"&$W36&\"'!$B$64\")),\"\")","v":""},34,{"$f":"VLOOKUP(AC36,$Z$3:$AA74,2)","v":"S1"},""]
[null,"",{"$f":"IF($AE37<>\"\",INDEX(INDIRECT(\"'\"&$AD37&\"'!$B$7:$I$100\"),$AE37,AG$2),\"\")","v":""},{"$f":"IF($AE37<>\"\",INDEX(INDIRECT(\"'\"&$AD37&\"'!$B$7:$I$100\"),$AE37,AH$2),\"\")","v":""},{"$f":"IF($AE37<>\"\",INDEX(INDIRECT(\"'\"&$AD37&\"'!$B$7:$I$100\"),$AE37,AI$2),\"\")","v":""},{"$f":"IF($AE37<>\"\",INDEX(INDIRECT(\"'\"&$AD37&\"'!$B$7:$I$100\"),$AE37,AJ$2),\"\")","v":""},{"$f":"IF($AE37<>\"\",INDEX(INDIRECT(\"'\"&$AD37&\"'!$B$7:$I$100\"),$AE37,AK$2),\"\")","v":""},{"$f":"IF($AE37<>\"\",INDEX(INDIRECT(\"'\"&$AD37&\"'!$B$7:$I$100\"),$AE37,AL$2),\"\")","v":""},{"$f":"IF($AE37<>\"\",INDEX(INDIRECT(\"'\"&$AD37&\"'!$B$7:$I$100\"),$AE37,AM$2),\"\")","v":""},{"$f":"IF($AE37<>\"\",INDEX(INDIRECT(\"'\"&$AD37&\"'!$B$7:$I$100\"),$AE37,AN$2),\"\")","v":""},null,null,null,null,null,null,null,null,null,null,null,{"$f":"IFERROR( INDIRECT(\"'\"&$W37&\"'!$B$4\"), \"\")","v":""},"S35","",false,{"$error":"#VALUE!"},"S35",{"$f":"IF(Y37=TRUE,COUNTA(INDIRECT(\"'\"&$W37&\"'!$B$7\"):INDIRECT(\"'\"&$W37&\"'!$B$64\")),\"\")","v":""},35,{"$f":"VLOOKUP(AC37,$Z$3:$AA75,2)","v":"S1"},""]
[null,"",{"$f":"IF($AE38<>\"\",INDEX(INDIRECT(\"'\"&$AD38&\"'!$B$7:$I$100\"),$AE38,AG$2),\"\")","v":""},{"$f":"IF($AE38<>\"\",INDEX(INDIRECT(\"'\"&$AD38&\"'!$B$7:$I$100\"),$AE38,AH$2),\"\")","v":""},{"$f":"IF($AE38<>\"\",INDEX(INDIRECT(\"'\"&$AD38&\"'!$B$7:$I$100\"),$AE38,AI$2),\"\")","v":""},{"$f":"IF($AE38<>\"\",INDEX(INDIRECT(\"'\"&$AD38&\"'!$B$7:$I$100\"),$AE38,AJ$2),\"\")","v":""},{"$f":"IF($AE38<>\"\",INDEX(INDIRECT(\"'\"&$AD38&\"'!$B$7:$I$100\"),$AE38,AK$2),\"\")","v":""},{"$f":"IF($AE38<>\"\",INDEX(INDIRECT(\"'\"&$AD38&\"'!$B$7:$I$100\"),$AE38,AL$2),\"\")","v":""},{"$f":"IF($AE38<>\"\",INDEX(INDIRECT(\"'\"&$AD38&\"'!$B$7:$I$100\"),$AE38,AM$2),\"\")","v":""},{"$f":"IF($AE38<>\"\",INDEX(INDIRECT(\"'\"&$AD38&\"'!$B$7:$I$100\"),$AE38,AN$2),\"\")","v":""},null,null,null,null,null,null,null,null,null,null,null,{"$f":"IFERROR( INDIRECT(\"'\"&$W38&\"'!$B$4\"), \"\")","v":""},"S36","",false,{"$error":"#VALUE!"},"S36",{"$f":"IF(Y38=TRUE,COUNTA(INDIRECT(\"'\"&$W38&\"'!$B$7\"):INDIRECT(\"'\"&$W38&\"'!$B$64\")),\"\")","v":""},36,{"$f":"VLOOKUP(AC38,$Z$3:$AA76,2)","v":"S1"},""]
[null,"",{"$f":"IF($AE39<>\"\",INDEX(INDIRECT(\"'\"&$AD39&\"'!$B$7:$I$100\"),$AE39,AG$2),\"\")","v":""},{"$f":"IF($AE39<>\"\",INDEX(INDIRECT(\"'\"&$AD39&\"'!$B$7:$I$100\"),$AE39,AH$2),\"\")","v":""},{"$f":"IF($AE39<>\"\",INDEX(INDIRECT(\"'\"&$AD39&\"'!$B$7:$I$100\"),$AE39,AI$2),\"\")","v":""},{"$f":"IF($AE39<>\"\",INDEX(INDIRECT(\"'\"&$AD39&\"'!$B$7:$I$100\"),$AE39,AJ$2),\"\")","v":""},{"$f":"IF($AE39<>\"\",INDEX(INDIRECT(\"'\"&$AD39&\"'!$B$7:$I$100\"),$AE39,AK$2),\"\")","v":""},{"$f":"IF($AE39<>\"\",INDEX(INDIRECT(\"'\"&$AD39&\"'!$B$7:$I$100\"),$AE39,AL$2),\"\")","v":""},{"$f":"IF($AE39<>\"\",INDEX(INDIRECT(\"'\"&$AD39&\"'!$B$7:$I$100\"),$AE39,AM$2),\"\")","v":""},{"$f":"IF($AE39<>\"\",INDEX(INDIRECT(\"'\"&$AD39&\"'!$B$7:$I$100\"),$AE39,AN$2),\"\")","v":""},null,null,null,null,null,null,null,null,null,null,null,{"$f":"IFERROR( INDIRECT(\"'\"&$W39&\"'!$B$4\"), \"\")","v":""},"S37","",false,{"$error":"#VALUE!"},"S37",{"$f":"IF(Y39=TRUE,COUNTA(INDIRECT(\"'\"&$W39&\"'!$B$7\"):INDIRECT(\"'\"&$W39&\"'!$B$64\")),\"\")","v":""},37,{"$f":"VLOOKUP(AC39,$Z$3:$AA77,2)","v":"S1"},""]
[null,"",{"$f":"IF($AE40<>\"\",INDEX(INDIRECT(\"'\"&$AD40&\"'!$B$7:$I$100\"),$AE40,AG$2),\"\")","v":""},{"$f":"IF($AE40<>\"\",INDEX(INDIRECT(\"'\"&$AD40&\"'!$B$7:$I$100\"),$AE40,AH$2),\"\")","v":""},{"$f":"IF($AE40<>\"\",INDEX(INDIRECT(\"'\"&$AD40&\"'!$B$7:$I$100\"),$AE40,AI$2),\"\")","v":""},{"$f":"IF($AE40<>\"\",INDEX(INDIRECT(\"'\"&$AD40&\"'!$B$7:$I$100\"),$AE40,AJ$2),\"\")","v":""},{"$f":"IF($AE40<>\"\",INDEX(INDIRECT(\"'\"&$AD40&\"'!$B$7:$I$100\"),$AE40,AK$2),\"\")","v":""},{"$f":"IF($AE40<>\"\",INDEX(INDIRECT(\"'\"&$AD40&\"'!$B$7:$I$100\"),$AE40,AL$2),\"\")","v":""},{"$f":"IF($AE40<>\"\",INDEX(INDIRECT(\"'\"&$AD40&\"'!$B$7:$I$100\"),$AE40,AM$2),\"\")","v":""},{"$f":"IF($AE40<>\"\",INDEX(INDIRECT(\"'\"&$AD40&\"'!$B$7:$I$100\"),$AE40,AN$2),\"\")","v":""},null,null,null,null,null,null,null,null,null,null,null,{"$f":"IFERROR( INDIRECT(\"'\"&$W40&\"'!$B$4\"), \"\")","v":""},"S38","",false,{"$error":"#VALUE!"},"S38",{"$f":"IF(Y40=TRUE,COUNTA(INDIRECT(\"'\"&$W40&\"'!$B$7\"):INDIRECT(\"'\"&$W40&\"'!$B$64\")),\"\")","v":""},38,{"$f":"VLOOKUP(AC40,$Z$3:$AA78,2)","v":"S1"},""]
[null,"",{"$f":"IF($AE41<>\"\",INDEX(INDIRECT(\"'\"&$AD41&\"'!$B$7:$I$100\"),$AE41,AG$2),\"\")","v":""},{"$f":"IF($AE41<>\"\",INDEX(INDIRECT(\"'\"&$AD41&\"'!$B$7:$I$100\"),$AE41,AH$2),\"\")","v":""},{"$f":"IF($AE41<>\"\",INDEX(INDIRECT(\"'\"&$AD41&\"'!$B$7:$I$100\"),$AE41,AI$2),\"\")","v":""},{"$f":"IF($AE41<>\"\",INDEX(INDIRECT(\"'\"&$AD41&\"'!$B$7:$I$100\"),$AE41,AJ$2),\"\")","v":""},{"$f":"IF($AE41<>\"\",INDEX(INDIRECT(\"'\"&$AD41&\"'!$B$7:$I$100\"),$AE41,AK$2),\"\")","v":""},{"$f":"IF($AE41<>\"\",INDEX(INDIRECT(\"'\"&$AD41&\"'!$B$7:$I$100\"),$AE41,AL$2),\"\")","v":""},{"$f":"IF($AE41<>\"\",INDEX(INDIRECT(\"'\"&$AD41&\"'!$B$7:$I$100\"),$AE41,AM$2),\"\")","v":""},{"$f":"IF($AE41<>\"\",INDEX(INDIRECT(\"'\"&$AD41&\"'!$B$7:$I$100\"),$AE41,AN$2),\"\")","v":""},null,null,null,null,null,null,null,null,null,null,null,{"$f":"IFERROR( INDIRECT(\"'\"&$W41&\"'!$B$4\"), \"\")","v":""},"S39","",false,{"$error":"#VALUE!"},"S39",{"$f":"IF(Y41=TRUE,COUNTA(INDIRECT(\"'\"&$W41&\"'!$B$7\"):INDIRECT(\"'\"&$W41&\"'!$B$64\")),\"\")","v":""},39,{"$f":"VLOOKUP(AC41,$Z$3:$AA79,2)","v":"S1"},""]
[null,"",{"$f":"IF($AE42<>\"\",INDEX(INDIRECT(\"'\"&$AD42&\"'!$B$7:$I$100\"),$AE42,AG$2),\"\")","v":""},{"$f":"IF($AE42<>\"\",INDEX(INDIRECT(\"'\"&$AD42&\"'!$B$7:$I$100\"),$AE42,AH$2),\"\")","v":""},{"$f":"IF($AE42<>\"\",INDEX(INDIRECT(\"'\"&$AD42&\"'!$B$7:$I$100\"),$AE42,AI$2),\"\")","v":""},{"$f":"IF($AE42<>\"\",INDEX(INDIRECT(\"'\"&$AD42&\"'!$B$7:$I$100\"),$AE42,AJ$2),\"\")","v":""},{"$f":"IF($AE42<>\"\",INDEX(INDIRECT(\"'\"&$AD42&\"'!$B$7:$I$100\"),$AE42,AK$2),\"\")","v":""},{"$f":"IF($AE42<>\"\",INDEX(INDIRECT(\"'\"&$AD42&\"'!$B$7:$I$100\"),$AE42,AL$2),\"\")","v":""},{"$f":"IF($AE42<>\"\",INDEX(INDIRECT(\"'\"&$AD42&\"'!$B$7:$I$100\"),$AE42,AM$2),\"\")","v":""},{"$f":"IF($AE42<>\"\",INDEX(INDIRECT(\"'\"&$AD42&\"'!$B$7:$I$100\"),$AE42,AN$2),\"\")","v":""},null,null,null,null,null,null,null,null,null,null,null,{"$f":"IFERROR( INDIRECT(\"'\"&$W42&\"'!$B$4\"), \"\")","v":""},"S40","",false,{"$error":"#VALUE!"},"S40",{"$f":"IF(Y42=TRUE,COUNTA(INDIRECT(\"'\"&$W42&\"'!$B$7\"):INDIRECT(\"'\"&$W42&\"'!$B$64\")),\"\")","v":""},40,{"$f":"VLOOKUP(AC42,$Z$3:$AA80,2)","v":"S1"},""]
[null,"",{"$f":"IF($AE43<>\"\",INDEX(INDIRECT(\"'\"&$AD43&\"'!$B$7:$I$100\"),$AE43,AG$2),\"\")","v":""},{"$f":"IF($AE43<>\"\",INDEX(INDIRECT(\"'\"&$AD43&\"'!$B$7:$I$100\"),$AE43,AH$2),\"\")","v":""},{"$f":"IF($AE43<>\"\",INDEX(INDIRECT(\"'\"&$AD43&\"'!$B$7:$I$100\"),$AE43,AI$2),\"\")","v":""},{"$f":"IF($AE43<>\"\",INDEX(INDIRECT(\"'\"&$AD43&\"'!$B$7:$I$100\"),$AE43,AJ$2),\"\")","v":""},{"$f":"IF($AE43<>\"\",INDEX(INDIRECT(\"'\"&$AD43&\"'!$B$7:$I$100\"),$AE43,AK$2),\"\")","v":""},{"$f":"IF($AE43<>\"\",INDEX(INDIRECT(\"'\"&$AD43&\"'!$B$7:$I$100\"),$AE43,AL$2),\"\")","v":""},{"$f":"IF($AE43<>\"\",INDEX(INDIRECT(\"'\"&$AD43&\"'!$B$7:$I$100\"),$AE43,AM$2),\"\")","v":""},{"$f":"IF($AE43<>\"\",INDEX(INDIRECT(\"'\"&$AD43&\"'!$B$7:$I$100\"),$AE43,AN$2),\"\")","v":""},null,null,null,null,null,null,null,null,null,null,null,{"$f":"IFERROR( INDIRECT(\"'\"&$W43&\"'!$B$4\"), \"\")","v":""},"S41","",false,{"$error":"#VALUE!"},"S41",null,41,{"$f":"VLOOKUP(AC43,$Z$3:$AA81,2)","v":"S1"},""]
[null,"",{"$f":"IF($AE44<>\"\",INDEX(INDIRECT(\"'\"&$AD44&\"'!$B$7:$I$100\"),$AE44,AG$2),\"\")","v":""},{"$f":"IF($AE44<>\"\",INDEX(INDIRECT(\"'\"&$AD44&\"'!$B$7:$I$100\"),$AE44,AH$2),\"\")","v":""},{"$f":"IF($AE44<>\"\",INDEX(INDIRECT(\"'\"&$AD44&\"'!$B$7:$I$100\"),$AE44,AI$2),\"\")","v":""},{"$f":"IF($AE44<>\"\",INDEX(INDIRECT(\"'\"&$AD44&\"'!$B$7:$I$100\"),$AE44,AJ$2),\"\")","v":""},{"$f":"IF($AE44<>\"\",INDEX(INDIRECT(\"'\"&$AD44&\"'!$B$7:$I$100\"),$AE44,AK$2),\"\")","v":""},{"$f":"IF($AE44<>\"\",INDEX(INDIRECT(\"'\"&$AD44&\"'!$B$7:$I$100\"),$AE44,AL$2),\"\")","v":""},{"$f":"IF($AE44<>\"\",INDEX(INDIRECT(\"'\"&$AD44&\"'!$B$7:$I$100\"),$AE44,AM$2),\"\")","v":""},{"$f":"IF($AE44<>\"\",INDEX(INDIRECT(\"'\"&$AD44&\"'!$B$7:$I$100\"),$AE44,AN$2),\"\")","v":""},null,null,null,null,null,null,null,null,null,null,null,{"$f":"IFERROR( INDIRECT(\"'\"&$W44&\"'!$B$4\"), \"\")","v":""},"S42","",false,{"$error":"#VALUE!"},"S42",null,42,{"$f":"VLOOKUP(AC44,$Z$3:$AA82,2)","v":"S1"},""]
[null,"",{"$f":"IF($AE45<>\"\",INDEX(INDIRECT(\"'\"&$AD45&\"'!$B$7:$I$100\"),$AE45,AG$2),\"\")","v":""},{"$f":"IF($AE45<>\"\",INDEX(INDIRECT(\"'\"&$AD45&\"'!$B$7:$I$100\"),$AE45,AH$2),\"\")","v":""},{"$f":"IF($AE45<>\"\",INDEX(INDIRECT(\"'\"&$AD45&\"'!$B$7:$I$100\"),$AE45,AI$2),\"\")","v":""},{"$f":"IF($AE45<>\"\",INDEX(INDIRECT(\"'\"&$AD45&\"'!$B$7:$I$100\"),$AE45,AJ$2),\"\")","v":""},{"$f":"IF($AE45<>\"\",INDEX(INDIRECT(\"'\"&$AD45&\"'!$B$7:$I$100\"),$AE45,AK$2),\"\")","v":""},{"$f":"IF($AE45<>\"\",INDEX(INDIRECT(\"'\"&$AD45&\"'!$B$7:$I$100\"),$AE45,AL$2),\"\")","v":""},{"$f":"IF($AE45<>\"\",INDEX(INDIRECT(\"'\"&$AD45&\"'!$B$7:$I$100\"),$AE45,AM$2),\"\")","v":""},{"$f":"IF($AE45<>\"\",INDEX(INDIRECT(\"'\"&$AD45&\"'!$B$7:$I$100\"),$AE45,AN$2),\"\")","v":""},null,null,null,null,null,null,null,null,null,null,null,{"$f":"IFERROR( INDIRECT(\"'\"&$W45&\"'!$B$4\"), \"\")","v":""},"S43","",false,{"$error":"#VALUE!"},"S43",null,43,{"$f":"VLOOKUP(AC45,$Z$3:$AA83,2)","v":"S1"},""]
[null,"",{"$f":"IF($AE46<>\"\",INDEX(INDIRECT(\"'\"&$AD46&\"'!$B$7:$I$100\"),$AE46,AG$2),\"\")","v":""},{"$f":"IF($AE46<>\"\",INDEX(INDIRECT(\"'\"&$AD46&\"'!$B$7:$I$100\"),$AE46,AH$2),\"\")","v":""},{"$f":"IF($AE46<>\"\",INDEX(INDIRECT(\"'\"&$AD46&\"'!$B$7:$I$100\"),$AE46,AI$2),\"\")","v":""},{"$f":"IF($AE46<>\"\",INDEX(INDIRECT(\"'\"&$AD46&\"'!$B$7:$I$100\"),$AE46,AJ$2),\"\")","v":""},{"$f":"IF($AE46<>\"\",INDEX(INDIRECT(\"'\"&$AD46&\"'!$B$7:$I$100\"),$AE46,AK$2),\"\")","v":""},{"$f":"IF($AE46<>\"\",INDEX(INDIRECT(\"'\"&$AD46&\"'!$B$7:$I$100\"),$AE46,AL$2),\"\")","v":""},{"$f":"IF($AE46<>\"\",INDEX(INDIRECT(\"'\"&$AD46&\"'!$B$7:$I$100\"),$AE46,AM$2),\"\")","v":""},{"$f":"IF($AE46<>\"\",INDEX(INDIRECT(\"'\"&$AD46&\"'!$B$7:$I$100\"),$AE46,AN$2),\"\")","v":""},null,null,null,null,null,null,null,null,null,null,null,{"$f":"IFERROR( INDIRECT(\"'\"&$W46&\"'!$B$4\"), \"\")","v":""},"S44","",false,{"$error":"#VALUE!"},"S44",null,44,{"$f":"VLOOKUP(AC46,$Z$3:$AA84,2)","v":"S1"},""]
[null,"",{"$f":"IF($AE47<>\"\",INDEX(INDIRECT(\"'\"&$AD47&\"'!$B$7:$I$100\"),$AE47,AG$2),\"\")","v":""},{"$f":"IF($AE47<>\"\",INDEX(INDIRECT(\"'\"&$AD47&\"'!$B$7:$I$100\"),$AE47,AH$2),\"\")","v":""},{"$f":"IF($AE47<>\"\",INDEX(INDIRECT(\"'\"&$AD47&\"'!$B$7:$I$100\"),$AE47,AI$2),\"\")","v":""},{"$f":"IF($AE47<>\"\",INDEX(INDIRECT(\"'\"&$AD47&\"'!$B$7:$I$100\"),$AE47,AJ$2),\"\")","v":""},{"$f":"IF($AE47<>\"\",INDEX(INDIRECT(\"'\"&$AD47&\"'!$B$7:$I$100\"),$AE47,AK$2),\"\")","v":""},{"$f":"IF($AE47<>\"\",INDEX(INDIRECT(\"'\"&$AD47&\"'!$B$7:$I$100\"),$AE47,AL$2),\"\")","v":""},{"$f":"IF($AE47<>\"\",INDEX(INDIRECT(\"'\"&$AD47&\"'!$B$7:$I$100\"),$AE47,AM$2),\"\")","v":""},{"$f":"IF($AE47<>\"\",INDEX(INDIRECT(\"'\"&$AD47&\"'!$B$7:$I$100\"),$AE47,AN$2),\"\")","v":""},null,null,null,null,null,null,null,null,null,null,null,{"$f":"IFERROR( INDIRECT(\"'\"&$W47&\"'!$B$4\"), \"\")","v":""},"S45","",false,{"$error":"#VALUE!"},"S45",null,45,{"$f":"VLOOKUP(AC47,$Z$3:$AA85,2)","v":"S1"},""]
[null,"",{"$f":"IF($AE48<>\"\",INDEX(INDIRECT(\"'\"&$AD48&\"'!$B$7:$I$100\"),$AE48,AG$2),\"\")","v":""},{"$f":"IF($AE48<>\"\",INDEX(INDIRECT(\"'\"&$AD48&\"'!$B$7:$I$100\"),$AE48,AH$2),\"\")","v":""},{"$f":"IF($AE48<>\"\",INDEX(INDIRECT(\"'\"&$AD48&\"'!$B$7:$I$100\"),$AE48,AI$2),\"\")","v":""},{"$f":"IF($AE48<>\"\",INDEX(INDIRECT(\"'\"&$AD48&\"'!$B$7:$I$100\"),$AE48,AJ$2),\"\")","v":""},{"$f":"IF($AE48<>\"\",INDEX(INDIRECT(\"'\"&$AD48&\"'!$B$7:$I$100\"),$AE48,AK$2),\"\")","v":""},{"$f":"IF($AE48<>\"\",INDEX(INDIRECT(\"'\"&$AD48&\"'!$B$7:$I$100\"),$AE48,AL$2),\"\")","v":""},{"$f":"IF($AE48<>\"\",INDEX(INDIRECT(\"'\"&$AD48&\"'!$B$7:$I$100\"),$AE48,AM$2),\"\")","v":""},{"$f":"IF($AE48<>\"\",INDEX(INDIRECT(\"'\"&$AD48&\"'!$B$7:$I$100\"),$AE48,AN$2),\"\")","v":""},null,null,null,null,null,null,null,null,null,null,null,{"$f":"IFERROR( INDIRECT(\"'\"&$W48&\"'!$B$4\"), \"\")","v":""},"S46","",false,{"$error":"#VALUE!"},"S46",null,46,{"$f":"VLOOKUP(AC48,$Z$3:$AA86,2)","v":"S1"},""]
[null,"",{"$f":"IF($AE49<>\"\",INDEX(INDIRECT(\"'\"&$AD49&\"'!$B$7:$I$100\"),$AE49,AG$2),\"\")","v":""},{"$f":"IF($AE49<>\"\",INDEX(INDIRECT(\"'\"&$AD49&\"'!$B$7:$I$100\"),$AE49,AH$2),\"\")","v":""},{"$f":"IF($AE49<>\"\",INDEX(INDIRECT(\"'\"&$AD49&\"'!$B$7:$I$100\"),$AE49,AI$2),\"\")","v":""},{"$f":"IF($AE49<>\"\",INDEX(INDIRECT(\"'\"&$AD49&\"'!$B$7:$I$100\"),$AE49,AJ$2),\"\")","v":""},{"$f":"IF($AE49<>\"\",INDEX(INDIRECT(\"'\"&$AD49&\"'!$B$7:$I$100\"),$AE49,AK$2),\"\")","v":""},{"$f":"IF($AE49<>\"\",INDEX(INDIRECT(\"'\"&$AD49&\"'!$B$7:$I$100\"),$AE49,AL$2),\"\")","v":""},{"$f":"IF($AE49<>\"\",INDEX(INDIRECT(\"'\"&$AD49&\"'!$B$7:$I$100\"),$AE49,AM$2),\"\")","v":""},{"$f":"IF($AE49<>\"\",INDEX(INDIRECT(\"'\"&$AD49&\"'!$B$7:$I$100\"),$AE49,AN$2),\"\")","v":""},null,null,null,null,null,null,null,null,null,null,null,{"$f":"IFERROR( INDIRECT(\"'\"&$W49&\"'!$B$4\"), \"\")","v":""},"S47","",false,{"$error":"#VALUE!"},"S47",null,47,{"$f":"VLOOKUP(AC49,$Z$3:$AA87,2)","v":"S1"},""]
[null,"",{"$f":"IF($AE50<>\"\",INDEX(INDIRECT(\"'\"&$AD50&\"'!$B$7:$I$100\"),$AE50,AG$2),\"\")","v":""},{"$f":"IF($AE50<>\"\",INDEX(INDIRECT(\"'\"&$AD50&\"'!$B$7:$I$100\"),$AE50,AH$2),\"\")","v":""},{"$f":"IF($AE50<>\"\",INDEX(INDIRECT(\"'\"&$AD50&\"'!$B$7:$I$100\"),$AE50,AI$2),\"\")","v":""},{"$f":"IF($AE50<>\"\",INDEX(INDIRECT(\"'\"&$AD50&\"'!$B$7:$I$100\"),$AE50,AJ$2),\"\")","v":""},{"$f":"IF($AE50<>\"\",INDEX(INDIRECT(\"'\"&$AD50&\"'!$B$7:$I$100\"),$AE50,AK$2),\"\")","v":""},{"$f":"IF($AE50<>\"\",INDEX(INDIRECT(\"'\"&$AD50&\"'!$B$7:$I$100\"),$AE50,AL$2),\"\")","v":""},{"$f":"IF($AE50<>\"\",INDEX(INDIRECT(\"'\"&$AD50&\"'!$B$7:$I$100\"),$AE50,AM$2),\"\")","v":""},{"$f":"IF($AE50<>\"\",INDEX(INDIRECT(\"'\"&$AD50&\"'!$B$7:$I$100\"),$AE50,AN$2),\"\")","v":""},null,null,null,null,null,null,null,null,null,null,null,{"$f":"IFERROR( INDIRECT(\"'\"&$W50&\"'!$B$4\"), \"\")","v":""},"S48","",false,{"$error":"#VALUE!"},"S48",null,48,{"$f":"VLOOKUP(AC50,$Z$3:$AA88,2)","v":"S1"},""]
[null,"",{"$f":"IF($AE51<>\"\",INDEX(INDIRECT(\"'\"&$AD51&\"'!$B$7:$I$100\"),$AE51,AG$2),\"\")","v":""},{"$f":"IF($AE51<>\"\",INDEX(INDIRECT(\"'\"&$AD51&\"'!$B$7:$I$100\"),$AE51,AH$2),\"\")","v":""},{"$f":"IF($AE51<>\"\",INDEX(INDIRECT(\"'\"&$AD51&\"'!$B$7:$I$100\"),$AE51,AI$2),\"\")","v":""},{"$f":"IF($AE51<>\"\",INDEX(INDIRECT(\"'\"&$AD51&\"'!$B$7:$I$100\"),$AE51,AJ$2),\"\")","v":""},{"$f":"IF($AE51<>\"\",INDEX(INDIRECT(\"'\"&$AD51&\"'!$B$7:$I$100\"),$AE51,AK$2),\"\")","v":""},{"$f":"IF($AE51<>\"\",INDEX(INDIRECT(\"'\"&$AD51&\"'!$B$7:$I$100\"),$AE51,AL$2),\"\")","v":""},{"$f":"IF($AE51<>\"\",INDEX(INDIRECT(\"'\"&$AD51&\"'!$B$7:$I$100\"),$AE51,AM$2),\"\")","v":""},{"$f":"IF($AE51<>\"\",INDEX(INDIRECT(\"'\"&$AD51&\"'!$B$7:$I$100\"),$AE51,AN$2),\"\")","v":""},null,null,null,null,null,null,null,null,null,null,null,{"$f":"IFERROR( INDIRECT(\"'\"&$W51&\"'!$B$4\"), \"\")","v":""},"S49","",false,{"$error":"#VALUE!"},"S49",null,49,{"$f":"VLOOKUP(AC51,$Z$3:$AA89,2)","v":"S1"},""]
[null,"",{"$f":"IF($AE52<>\"\",INDEX(INDIRECT(\"'\"&$AD52&\"'!$B$7:$I$100\"),$AE52,AG$2),\"\")","v":""},{"$f":"IF($AE52<>\"\",INDEX(INDIRECT(\"'\"&$AD52&\"'!$B$7:$I$100\"),$AE52,AH$2),\"\")","v":""},{"$f":"IF($AE52<>\"\",INDEX(INDIRECT(\"'\"&$AD52&\"'!$B$7:$I$100\"),$AE52,AI$2),\"\")","v":""},{"$f":"IF($AE52<>\"\",INDEX(INDIRECT(\"'\"&$AD52&\"'!$B$7:$I$100\"),$AE52,AJ$2),\"\")","v":""},{"$f":"IF($AE52<>\"\",INDEX(INDIRECT(\"'\"&$AD52&\"'!$B$7:$I$100\"),$AE52,AK$2),\"\")","v":""},{"$f":"IF($AE52<>\"\",INDEX(INDIRECT(\"'\"&$AD52&\"'!$B$7:$I$100\"),$AE52,AL$2),\"\")","v":""},{"$f":"IF($AE52<>\"\",INDEX(INDIRECT(\"'\"&$AD52&\"'!$B$7:$I$100\"),$AE52,AM$2),\"\")","v":""},{"$f":"IF($AE52<>\"\",INDEX(INDIRECT(\"'\"&$AD52&\"'!$B$7:$I$100\"),$AE52,AN$2),\"\")","v":""},null,null,null,null,null,null,null,null,null,null,null,{"$f":"IFERROR( INDIRECT(\"'\"&$W52&\"'!$B$4\"), \"\")","v":""},"S50","",false,{"$error":"#VALUE!"},"S50",null,50,{"$f":"VLOOKUP(AC52,$Z$3:$AA90,2)","v":"S1"},""]
[null,"",{"$f":"IF($AE53<>\"\",INDEX(INDIRECT(\"'\"&$AD53&\"'!$B$7:$I$100\"),$AE53,AG$2),\"\")","v":""},{"$f":"IF($AE53<>\"\",INDEX(INDIRECT(\"'\"&$AD53&\"'!$B$7:$I$100\"),$AE53,AH$2),\"\")","v":""},{"$f":"IF($AE53<>\"\",INDEX(INDIRECT(\"'\"&$AD53&\"'!$B$7:$I$100\"),$AE53,AI$2),\"\")","v":""},{"$f":"IF($AE53<>\"\",INDEX(INDIRECT(\"'\"&$AD53&\"'!$B$7:$I$100\"),$AE53,AJ$2),\"\")","v":""},{"$f":"IF($AE53<>\"\",INDEX(INDIRECT(\"'\"&$AD53&\"'!$B$7:$I$100\"),$AE53,AK$2),\"\")","v":""},{"$f":"IF($AE53<>\"\",INDEX(INDIRECT(\"'\"&$AD53&\"'!$B$7:$I$100\"),$AE53,AL$2),\"\")","v":""},{"$f":"IF($AE53<>\"\",INDEX(INDIRECT(\"'\"&$AD53&\"'!$B$7:$I$100\"),$AE53,AM$2),\"\")","v":""},{"$f":"IF($AE53<>\"\",INDEX(INDIRECT(\"'\"&$AD53&\"'!$B$7:$I$100\"),$AE53,AN$2),\"\")","v":""},null,null,null,null,null,null,null,null,null,null,null,{"$f":"IFERROR( INDIRECT(\"'\"&$W53&\"'!$B$4\"), \"\")","v":""},"S51","",false,{"$error":"#VALUE!"},"S51",null,51,{"$f":"VLOOKUP(AC53,$Z$3:$AA91,2)","v":"S1"},""]
[null,"",{"$f":"IF($AE54<>\"\",INDEX(INDIRECT(\"'\"&$AD54&\"'!$B$7:$I$100\"),$AE54,AG$2),\"\")","v":""},{"$f":"IF($AE54<>\"\",INDEX(INDIRECT(\"'\"&$AD54&\"'!$B$7:$I$100\"),$AE54,AH$2),\"\")","v":""},{"$f":"IF($AE54<>\"\",INDEX(INDIRECT(\"'\"&$AD54&\"'!$B$7:$I$100\"),$AE54,AI$2),\"\")","v":""},{"$f":"IF($AE54<>\"\",INDEX(INDIRECT(\"'\"&$AD54&\"'!$B$7:$I$100\"),$AE54,AJ$2),\"\")","v":""},{"$f":"IF($AE54<>\"\",INDEX(INDIRECT(\"'\"&$AD54&\"'!$B$7:$I$100\"),$AE54,AK$2),\"\")","v":""},{"$f":"IF($AE54<>\"\",INDEX(INDIRECT(\"'\"&$AD54&\"'!$B$7:$I$100\"),$AE54,AL$2),\"\")","v":""},{"$f":"IF($AE54<>\"\",INDEX(INDIRECT(\"'\"&$AD54&\"'!$B$7:$I$100\"),$AE54,AM$2),\"\")","v":""},{"$f":"IF($AE54<>\"\",INDEX(INDIRECT(\"'\"&$AD54&\"'!$B$7:$I$100\"),$AE54,AN$2),\"\")","v":""},null,null,null,null,null,null,null,null,null,null,null,{"$f":"IFERROR( INDIRECT(\"'\"&$W54&\"'!$B$4\"), \"\")","v":""},"S52","",false,{"$error":"#VALUE!"},"S52",null,52,{"$f":"VLOOKUP(AC54,$Z$3:$AA92,2)","v":"S1"},""]
[null,"",{"$f":"IF($AE55<>\"\",INDEX(INDIRECT(\"'\"&$AD55&\"'!$B$7:$I$100\"),$AE55,AG$2),\"\")","v":""},{"$f":"IF($AE55<>\"\",INDEX(INDIRECT(\"'\"&$AD55&\"'!$B$7:$I$100\"),$AE55,AH$2),\"\")","v":""},{"$f":"IF($AE55<>\"\",INDEX(INDIRECT(\"'\"&$AD55&\"'!$B$7:$I$100\"),$AE55,AI$2),\"\")","v":""},{"$f":"IF($AE55<>\"\",INDEX(INDIRECT(\"'\"&$AD55&\"'!$B$7:$I$100\"),$AE55,AJ$2),\"\")","v":""},{"$f":"IF($AE55<>\"\",INDEX(INDIRECT(\"'\"&$AD55&\"'!$B$7:$I$100\"),$AE55,AK$2),\"\")","v":""},{"$f":"IF($AE55<>\"\",INDEX(INDIRECT(\"'\"&$AD55&\"'!$B$7:$I$100\"),$AE55,AL$2),\"\")","v":""},{"$f":"IF($AE55<>\"\",INDEX(INDIRECT(\"'\"&$AD55&\"'!$B$7:$I$100\"),$AE55,AM$2),\"\")","v":""},{"$f":"IF($AE55<>\"\",INDEX(INDIRECT(\"'\"&$AD55&\"'!$B$7:$I$100\"),$AE55,AN$2),\"\")","v":""},null,null,null,null,null,null,null,null,null,null,null,{"$f":"IFERROR( INDIRECT(\"'\"&$W55&\"'!$B$4\"), \"\")","v":""},"S53","",false,{"$error":"#VALUE!"},"S53",null,53,{"$f":"VLOOKUP(AC55,$Z$3:$AA93,2)","v":"S1"},""]
[null,"",{"$f":"IF($AE56<>\"\",INDEX(INDIRECT(\"'\"&$AD56&\"'!$B$7:$I$100\"),$AE56,AG$2),\"\")","v":""},{"$f":"IF($AE56<>\"\",INDEX(INDIRECT(\"'\"&$AD56&\"'!$B$7:$I$100\"),$AE56,AH$2),\"\")","v":""},{"$f":"IF($AE56<>\"\",INDEX(INDIRECT(\"'\"&$AD56&\"'!$B$7:$I$100\"),$AE56,AI$2),\"\")","v":""},{"$f":"IF($AE56<>\"\",INDEX(INDIRECT(\"'\"&$AD56&\"'!$B$7:$I$100\"),$AE56,AJ$2),\"\")","v":""},{"$f":"IF($AE56<>\"\",INDEX(INDIRECT(\"'\"&$AD56&\"'!$B$7:$I$100\"),$AE56,AK$2),\"\")","v":""},{"$f":"IF($AE56<>\"\",INDEX(INDIRECT(\"'\"&$AD56&\"'!$B$7:$I$100\"),$AE56,AL$2),\"\")","v":""},{"$f":"IF($AE56<>\"\",INDEX(INDIRECT(\"'\"&$AD56&\"'!$B$7:$I$100\"),$AE56,AM$2),\"\")","v":""},{"$f":"IF($AE56<>\"\",INDEX(INDIRECT(\"'\"&$AD56&\"'!$B$7:$I$100\"),$AE56,AN$2),\"\")","v":""},null,null,null,null,null,null,null,null,null,null,null,{"$f":"IFERROR( INDIRECT(\"'\"&$W56&\"'!$B$4\"), \"\")","v":""},"S54","",false,{"$error":"#VALUE!"},"S54",null,54,{"$f":"VLOOKUP(AC56,$Z$3:$AA94,2)","v":"S1"},""]
[null,"",{"$f":"IF($AE57<>\"\",INDEX(INDIRECT(\"'\"&$AD57&\"'!$B$7:$I$100\"),$AE57,AG$2),\"\")","v":""},{"$f":"IF($AE57<>\"\",INDEX(INDIRECT(\"'\"&$AD57&\"'!$B$7:$I$100\"),$AE57,AH$2),\"\")","v":""},{"$f":"IF($AE57<>\"\",INDEX(INDIRECT(\"'\"&$AD57&\"'!$B$7:$I$100\"),$AE57,AI$2),\"\")","v":""},{"$f":"IF($AE57<>\"\",INDEX(INDIRECT(\"'\"&$AD57&\"'!$B$7:$I$100\"),$AE57,AJ$2),\"\")","v":""},{"$f":"IF($AE57<>\"\",INDEX(INDIRECT(\"'\"&$AD57&\"'!$B$7:$I$100\"),$AE57,AK$2),\"\")","v":""},{"$f":"IF($AE57<>\"\",INDEX(INDIRECT(\"'\"&$AD57&\"'!$B$7:$I$100\"),$AE57,AL$2),\"\")","v":""},{"$f":"IF($AE57<>\"\",INDEX(INDIRECT(\"'\"&$AD57&\"'!$B$7:$I$100\"),$AE57,AM$2),\"\")","v":""},{"$f":"IF($AE57<>\"\",INDEX(INDIRECT(\"'\"&$AD57&\"'!$B$7:$I$100\"),$AE57,AN$2),\"\")","v":""},null,null,null,null,null,null,null,null,null,null,null,{"$f":"IFERROR( INDIRECT(\"'\"&$W57&\"'!$B$4\"), \"\")","v":""},"S55","",false,{"$error":"#VALUE!"},"S55",null,55,{"$f":"VLOOKUP(AC57,$Z$3:$AA95,2)","v":"S1"},""]
[null,"",{"$f":"IF($AE58<>\"\",INDEX(INDIRECT(\"'\"&$AD58&\"'!$B$7:$I$100\"),$AE58,AG$2),\"\")","v":""},{"$f":"IF($AE58<>\"\",INDEX(INDIRECT(\"'\"&$AD58&\"'!$B$7:$I$100\"),$AE58,AH$2),\"\")","v":""},{"$f":"IF($AE58<>\"\",INDEX(INDIRECT(\"'\"&$AD58&\"'!$B$7:$I$100\"),$AE58,AI$2),\"\")","v":""},{"$f":"IF($AE58<>\"\",INDEX(INDIRECT(\"'\"&$AD58&\"'!$B$7:$I$100\"),$AE58,AJ$2),\"\")","v":""},{"$f":"IF($AE58<>\"\",INDEX(INDIRECT(\"'\"&$AD58&\"'!$B$7:$I$100\"),$AE58,AK$2),\"\")","v":""},{"$f":"IF($AE58<>\"\",INDEX(INDIRECT(\"'\"&$AD58&\"'!$B$7:$I$100\"),$AE58,AL$2),\"\")","v":""},{"$f":"IF($AE58<>\"\",INDEX(INDIRECT(\"'\"&$AD58&\"'!$B$7:$I$100\"),$AE58,AM$2),\"\")","v":""},{"$f":"IF($AE58<>\"\",INDEX(INDIRECT(\"'\"&$AD58&\"'!$B$7:$I$100\"),$AE58,AN$2),\"\")","v":""},null,null,null,null,null,null,null,null,null,null,null,{"$f":"IFERROR( INDIRECT(\"'\"&$W58&\"'!$B$4\"), \"\")","v":""},"S56","",false,{"$error":"#VALUE!"},"S56",null,56,{"$f":"VLOOKUP(AC58,$Z$3:$AA96,2)","v":"S1"},""]
[null,"",{"$f":"IF($AE59<>\"\",INDEX(INDIRECT(\"'\"&$AD59&\"'!$B$7:$I$100\"),$AE59,AG$2),\"\")","v":""},{"$f":"IF($AE59<>\"\",INDEX(INDIRECT(\"'\"&$AD59&\"'!$B$7:$I$100\"),$AE59,AH$2),\"\")","v":""},{"$f":"IF($AE59<>\"\",INDEX(INDIRECT(\"'\"&$AD59&\"'!$B$7:$I$100\"),$AE59,AI$2),\"\")","v":""},{"$f":"IF($AE59<>\"\",INDEX(INDIRECT(\"'\"&$AD59&\"'!$B$7:$I$100\"),$AE59,AJ$2),\"\")","v":""},{"$f":"IF($AE59<>\"\",INDEX(INDIRECT(\"'\"&$AD59&\"'!$B$7:$I$100\"),$AE59,AK$2),\"\")","v":""},{"$f":"IF($AE59<>\"\",INDEX(INDIRECT(\"'\"&$AD59&\"'!$B$7:$I$100\"),$AE59,AL$2),\"\")","v":""},{"$f":"IF($AE59<>\"\",INDEX(INDIRECT(\"'\"&$AD59&\"'!$B$7:$I$100\"),$AE59,AM$2),\"\")","v":""},{"$f":"IF($AE59<>\"\",INDEX(INDIRECT(\"'\"&$AD59&\"'!$B$7:$I$100\"),$AE59,AN$2),\"\")","v":""},null,null,null,null,null,null,null,null,null,null,null,{"$f":"IFERROR( INDIRECT(\"'\"&$W59&\"'!$B$4\"), \"\")","v":""},"S57","",false,{"$error":"#VALUE!"},"S57",null,57,{"$f":"VLOOKUP(AC59,$Z$3:$AA97,2)","v":"S1"},""]
[null,"",{"$f":"IF($AE60<>\"\",INDEX(INDIRECT(\"'\"&$AD60&\"'!$B$7:$I$100\"),$AE60,AG$2),\"\")","v":""},{"$f":"IF($AE60<>\"\",INDEX(INDIRECT(\"'\"&$AD60&\"'!$B$7:$I$100\"),$AE60,AH$2),\"\")","v":""},{"$f":"IF($AE60<>\"\",INDEX(INDIRECT(\"'\"&$AD60&\"'!$B$7:$I$100\"),$AE60,AI$2),\"\")","v":""},{"$f":"IF($AE60<>\"\",INDEX(INDIRECT(\"'\"&$AD60&\"'!$B$7:$I$100\"),$AE60,AJ$2),\"\")","v":""},{"$f":"IF($AE60<>\"\",INDEX(INDIRECT(\"'\"&$AD60&\"'!$B$7:$I$100\"),$AE60,AK$2),\"\")","v":""},{"$f":"IF($AE60<>\"\",INDEX(INDIRECT(\"'\"&$AD60&\"'!$B$7:$I$100\"),$AE60,AL$2),\"\")","v":""},{"$f":"IF($AE60<>\"\",INDEX(INDIRECT(\"'\"&$AD60&\"'!$B$7:$I$100\"),$AE60,AM$2),\"\")","v":""},{"$f":"IF($AE60<>\"\",INDEX(INDIRECT(\"'\"&$AD60&\"'!$B$7:$I$100\"),$AE60,AN$2),\"\")","v":""},null,null,null,null,null,null,null,null,null,null,null,{"$f":"IFERROR( INDIRECT(\"'\"&$W60&\"'!$B$4\"), \"\")","v":""},"S58","",false,{"$error":"#VALUE!"},"S58",null,58,{"$f":"VLOOKUP(AC60,$Z$3:$AA98,2)","v":"S1"},""]
[null,{"$f":"IF($AE61<>\"\",VLOOKUP(AD61,$W$3:$X$42,2,FALSE),\"\")","v":""},{"$f":"IF($AE61<>\"\",INDEX(INDIRECT(\"'\"&$AD61&\"'!$B$7:$I$100\"),$AE61,AG$2),\"\")","v":""},{"$f":"IF($AE61<>\"\",INDEX(INDIRECT(\"'\"&$AD61&\"'!$B$7:$I$100\"),$AE61,AH$2),\"\")","v":""},{"$f":"IF($AE61<>\"\",INDEX(INDIRECT(\"'\"&$AD61&\"'!$B$7:$I$100\"),$AE61,AI$2),\"\")","v":""},{"$f":"IF($AE61<>\"\",INDEX(INDIRECT(\"'\"&$AD61&\"'!$B$7:$I$100\"),$AE61,AJ$2),\"\")","v":""},{"$f":"IF($AE61<>\"\",INDEX(INDIRECT(\"'\"&$AD61&\"'!$B$7:$I$100\"),$AE61,AK$2),\"\")","v":""},{"$f":"IF($AE61<>\"\",INDEX(INDIRECT(\"'\"&$AD61&\"'!$B$7:$I$100\"),$AE61,AL$2),\"\")","v":""},{"$f":"IF($AE61<>\"\",INDEX(INDIRECT(\"'\"&$AD61&\"'!$B$7:$I$100\"),$AE61,AM$2),\"\")","v":""},{"$f":"IF($AE61<>\"\",INDEX(INDIRECT(\"'\"&$AD61&\"'!$B$7:$I$100\"),$AE61,AN$2),\"\")","v":""},null,null,null,null,null,null,null,null,null,null,null,{"$f":"IFERROR( INDIRECT(\"'\"&$W61&\"'!$B$4\"), \"\")","v":""},"S59","",false,{"$error":"#VALUE!"},"S59",null,59,{"$f":"VLOOKUP(AC61,$Z$3:$AA99,2)","v":"S1"},""]
[null,"",{"$f":"IF($AE62<>\"\",INDEX(INDIRECT(\"'\"&$AD62&\"'!$B$7:$I$100\"),$AE62,AG$2),\"\")","v":""},{"$f":"IF($AE62<>\"\",INDEX(INDIRECT(\"'\"&$AD62&\"'!$B$7:$I$100\"),$AE62,AH$2),\"\")","v":""},{"$f":"IF($AE62<>\"\",INDEX(INDIRECT(\"'\"&$AD62&\"'!$B$7:$I$100\"),$AE62,AI$2),\"\")","v":""},{"$f":"IF($AE62<>\"\",INDEX(INDIRECT(\"'\"&$AD62&\"'!$B$7:$I$100\"),$AE62,AJ$2),\"\")","v":""},{"$f":"IF($AE62<>\"\",INDEX(INDIRECT(\"'\"&$AD62&\"'!$B$7:$I$100\"),$AE62,AK$2),\"\")","v":""},{"$f":"IF($AE62<>\"\",INDEX(INDIRECT(\"'\"&$AD62&\"'!$B$7:$I$100\"),$AE62,AL$2),\"\")","v":""},{"$f":"IF($AE62<>\"\",INDEX(INDIRECT(\"'\"&$AD62&\"'!$B$7:$I$100\"),$AE62,AM$2),\"\")","v":""},{"$f":"IF($AE62<>\"\",INDEX(INDIRECT(\"'\"&$AD62&\"'!$B$7:$I$100\"),$AE62,AN$2),\"\")","v":""},null,null,null,null,null,null,null,null,null,null,null,{"$f":"IFERROR( INDIRECT(\"'\"&$W62&\"'!$B$4\"), \"\")","v":""},"S60","",false,{"$error":"#VALUE!"},"S60",null,60,{"$f":"VLOOKUP(AC62,$Z$3:$AA100,2)","v":"S1"},""]
[null,"",{"$f":"IF($AE63<>\"\",INDEX(INDIRECT(\"'\"&$AD63&\"'!$B$7:$I$100\"),$AE63,AG$2),\"\")","v":""},{"$f":"IF($AE63<>\"\",INDEX(INDIRECT(\"'\"&$AD63&\"'!$B$7:$I$100\"),$AE63,AH$2),\"\")","v":""},{"$f":"IF($AE63<>\"\",INDEX(INDIRECT(\"'\"&$AD63&\"'!$B$7:$I$100\"),$AE63,AI$2),\"\")","v":""},{"$f":"IF($AE63<>\"\",INDEX(INDIRECT(\"'\"&$AD63&\"'!$B$7:$I$100\"),$AE63,AJ$2),\"\")","v":""},{"$f":"IF($AE63<>\"\",INDEX(INDIRECT(\"'\"&$AD63&\"'!$B$7:$I$100\"),$AE63,AK$2),\"\")","v":""},{"$f":"IF($AE63<>\"\",INDEX(INDIRECT(\"'\"&$AD63&\"'!$B$7:$I$100\"),$AE63,AL$2),\"\")","v":""},{"$f":"IF($AE63<>\"\",INDEX(INDIRECT(\"'\"&$AD63&\"'!$B$7:$I$100\"),$AE63,AM$2),\"\")","v":""},{"$f":"IF($AE63<>\"\",INDEX(INDIRECT(\"'\"&$AD63&\"'!$B$7:$I$100\"),$AE63,AN$2),\"\")","v":""},null,null,null,null,null,null,null,null,null,null,null,{"$f":"IFERROR( INDIRECT(\"'\"&$W63&\"'!$B$4\"), \"\")","v":""},"S61","",false,{"$error":"#VALUE!"},"S61",null,61,{"$f":"VLOOKUP(AC63,$Z$3:$AA101,2)","v":"S1"},""]
[null,"",{"$f":"IF($AE64<>\"\",INDEX(INDIRECT(\"'\"&$AD64&\"'!$B$7:$I$100\"),$AE64,AG$2),\"\")","v":""},{"$f":"IF($AE64<>\"\",INDEX(INDIRECT(\"'\"&$AD64&\"'!$B$7:$I$100\"),$AE64,AH$2),\"\")","v":""},{"$f":"IF($AE64<>\"\",INDEX(INDIRECT(\"'\"&$AD64&\"'!$B$7:$I$100\"),$AE64,AI$2),\"\")","v":""},{"$f":"IF($AE64<>\"\",INDEX(INDIRECT(\"'\"&$AD64&\"'!$B$7:$I$100\"),$AE64,AJ$2),\"\")","v":""},{"$f":"IF($AE64<>\"\",INDEX(INDIRECT(\"'\"&$AD64&\"'!$B$7:$I$100\"),$AE64,AK$2),\"\")","v":""},{"$f":"IF($AE64<>\"\",INDEX(INDIRECT(\"'\"&$AD64&\"'!$B$7:$I$100\"),$AE64,AL$2),\"\")","v":""},{"$f":"IF($AE64<>\"\",INDEX(INDIRECT(\"'\"&$AD64&\"'!$B$7:$I$100\"),$AE64,AM$2),\"\")","v":""},{"$f":"IF($AE64<>\"\",INDEX(INDIRECT(\"'\"&$AD64&\"'!$B$7:$I$100\"),$AE64,AN$2),\"\")","v":""},null,null,null,null,null,null,null,null,null,null,null,{"$f":"IFERROR( INDIRECT(\"'\"&$W64&\"'!$B$4\"), \"\")","v":""},"S62","",false,{"$error":"#VALUE!"},"S62",null,62,{"$f":"VLOOKUP(AC64,$Z$3:$AA102,2)","v":"S1"},""]
[null,"",{"$f":"IF($AE65<>\"\",INDEX(INDIRECT(\"'\"&$AD65&\"'!$B$7:$I$100\"),$AE65,AG$2),\"\")","v":""},{"$f":"IF($AE65<>\"\",INDEX(INDIRECT(\"'\"&$AD65&\"'!$B$7:$I$100\"),$AE65,AH$2),\"\")","v":""},{"$f":"IF($AE65<>\"\",INDEX(INDIRECT(\"'\"&$AD65&\"'!$B$7:$I$100\"),$AE65,AI$2),\"\")","v":""},{"$f":"IF($AE65<>\"\",INDEX(INDIRECT(\"'\"&$AD65&\"'!$B$7:$I$100\"),$AE65,AJ$2),\"\")","v":""},{"$f":"IF($AE65<>\"\",INDEX(INDIRECT(\"'\"&$AD65&\"'!$B$7:$I$100\"),$AE65,AK$2),\"\")","v":""},{"$f":"IF($AE65<>\"\",INDEX(INDIRECT(\"'\"&$AD65&\"'!$B$7:$I$100\"),$AE65,AL$2),\"\")","v":""},{"$f":"IF($AE65<>\"\",INDEX(INDIRECT(\"'\"&$AD65&\"'!$B$7:$I$100\"),$AE65,AM$2),\"\")","v":""},{"$f":"IF($AE65<>\"\",INDEX(INDIRECT(\"'\"&$AD65&\"'!$B$7:$I$100\"),$AE65,AN$2),\"\")","v":""},null,null,null,null,null,null,null,null,null,null,null,{"$f":"IFERROR( INDIRECT(\"'\"&$W65&\"'!$B$4\"), \"\")","v":""},"S63","",false,{"$error":"#VALUE!"},"S63",null,63,{"$f":"VLOOKUP(AC65,$Z$3:$AA103,2)","v":"S1"},""]
[null,"",{"$f":"IF($AE66<>\"\",INDEX(INDIRECT(\"'\"&$AD66&\"'!$B$7:$I$100\"),$AE66,AG$2),\"\")","v":""},{"$f":"IF($AE66<>\"\",INDEX(INDIRECT(\"'\"&$AD66&\"'!$B$7:$I$100\"),$AE66,AH$2),\"\")","v":""},{"$f":"IF($AE66<>\"\",INDEX(INDIRECT(\"'\"&$AD66&\"'!$B$7:$I$100\"),$AE66,AI$2),\"\")","v":""},{"$f":"IF($AE66<>\"\",INDEX(INDIRECT(\"'\"&$AD66&\"'!$B$7:$I$100\"),$AE66,AJ$2),\"\")","v":""},{"$f":"IF($AE66<>\"\",INDEX(INDIRECT(\"'\"&$AD66&\"'!$B$7:$I$100\"),$AE66,AK$2),\"\")","v":""},{"$f":"IF($AE66<>\"\",INDEX(INDIRECT(\"'\"&$AD66&\"'!$B$7:$I$100\"),$AE66,AL$2),\"\")","v":""},{"$f":"IF($AE66<>\"\",INDEX(INDIRECT(\"'\"&$AD66&\"'!$B$7:$I$100\"),$AE66,AM$2),\"\")","v":""},{"$f":"IF($AE66<>\"\",INDEX(INDIRECT(\"'\"&$AD66&\"'!$B$7:$I$100\"),$AE66,AN$2),\"\")","v":""},null,null,null,null,null,null,null,null,null,null,null,{"$f":"IFERROR( INDIRECT(\"'\"&$W66&\"'!$B$4\"), \"\")","v":""},"S64","",false,{"$error":"#VALUE!"},"S64",null,64,{"$f":"VLOOKUP(AC66,$Z$3:$AA104,2)","v":"S1"},""]
[null,"",{"$f":"IF($AE67<>\"\",INDEX(INDIRECT(\"'\"&$AD67&\"'!$B$7:$I$100\"),$AE67,AG$2),\"\")","v":""},{"$f":"IF($AE67<>\"\",INDEX(INDIRECT(\"'\"&$AD67&\"'!$B$7:$I$100\"),$AE67,AH$2),\"\")","v":""},{"$f":"IF($AE67<>\"\",INDEX(INDIRECT(\"'\"&$AD67&\"'!$B$7:$I$100\"),$AE67,AI$2),\"\")","v":""},{"$f":"IF($AE67<>\"\",INDEX(INDIRECT(\"'\"&$AD67&\"'!$B$7:$I$100\"),$AE67,AJ$2),\"\")","v":""},{"$f":"IF($AE67<>\"\",INDEX(INDIRECT(\"'\"&$AD67&\"'!$B$7:$I$100\"),$AE67,AK$2),\"\")","v":""},{"$f":"IF($AE67<>\"\",INDEX(INDIRECT(\"'\"&$AD67&\"'!$B$7:$I$100\"),$AE67,AL$2),\"\")","v":""},{"$f":"IF($AE67<>\"\",INDEX(INDIRECT(\"'\"&$AD67&\"'!$B$7:$I$100\"),$AE67,AM$2),\"\")","v":""},{"$f":"IF($AE67<>\"\",INDEX(INDIRECT(\"'\"&$AD67&\"'!$B$7:$I$100\"),$AE67,AN$2),\"\")","v":""},null,null,null,null,null,null,null,null,null,null,null,{"$f":"IFERROR( INDIRECT(\"'\"&$W67&\"'!$B$4\"), \"\")","v":""},"S65","",false,{"$error":"#VALUE!"},"S65",null,65,{"$f":"VLOOKUP(AC67,$Z$3:$AA105,2)","v":"S1"},""]
[null,"",{"$f":"IF($AE68<>\"\",INDEX(INDIRECT(\"'\"&$AD68&\"'!$B$7:$I$100\"),$AE68,AG$2),\"\")","v":""},{"$f":"IF($AE68<>\"\",INDEX(INDIRECT(\"'\"&$AD68&\"'!$B$7:$I$100\"),$AE68,AH$2),\"\")","v":""},{"$f":"IF($AE68<>\"\",INDEX(INDIRECT(\"'\"&$AD68&\"'!$B$7:$I$100\"),$AE68,AI$2),\"\")","v":""},{"$f":"IF($AE68<>\"\",INDEX(INDIRECT(\"'\"&$AD68&\"'!$B$7:$I$100\"),$AE68,AJ$2),\"\")","v":""},{"$f":"IF($AE68<>\"\",INDEX(INDIRECT(\"'\"&$AD68&\"'!$B$7:$I$100\"),$AE68,AK$2),\"\")","v":""},{"$f":"IF($AE68<>\"\",INDEX(INDIRECT(\"'\"&$AD68&\"'!$B$7:$I$100\"),$AE68,AL$2),\"\")","v":""},{"$f":"IF($AE68<>\"\",INDEX(INDIRECT(\"'\"&$AD68&\"'!$B$7:$I$100\"),$AE68,AM$2),\"\")","v":""},{"$f":"IF($AE68<>\"\",INDEX(INDIRECT(\"'\"&$AD68&\"'!$B$7:$I$100\"),$AE68,AN$2),\"\")","v":""},null,null,null,null,null,null,null,null,null,null,null,{"$f":"IFERROR( INDIRECT(\"'\"&$W68&\"'!$B$4\"), \"\")","v":""},"S66",{"$f":"V68","v":""},{"$f":"ISREF(INDIRECT(\"'\"&$W68&\"'!A1\"))","v":false},{"$f":"AB67+Z67","v":{"$error":"#VALUE!"}},"S66",null,66,{"$f":"VLOOKUP(AC68,$Z$3:$AA106,2)","v":"S1"},""]
[null,"",{"$f":"IF($AE69<>\"\",INDEX(INDIRECT(\"'\"&$AD69&\"'!$B$7:$I$100\"),$AE69,AG$2),\"\")","v":""},{"$f":"IF($AE69<>\"\",INDEX(INDIRECT(\"'\"&$AD69&\"'!$B$7:$I$100\"),$AE69,AH$2),\"\")","v":""},{"$f":"IF($AE69<>\"\",INDEX(INDIRECT(\"'\"&$AD69&\"'!$B$7:$I$100\"),$AE69,AI$2),\"\")","v":""},{"$f":"IF($AE69<>\"\",INDEX(INDIRECT(\"'\"&$AD69&\"'!$B$7:$I$100\"),$AE69,AJ$2),\"\")","v":""},{"$f":"IF($AE69<>\"\",INDEX(INDIRECT(\"'\"&$AD69&\"'!$B$7:$I$100\"),$AE69,AK$2),\"\")","v":""},{"$f":"IF($AE69<>\"\",INDEX(INDIRECT(\"'\"&$AD69&\"'!$B$7:$I$100\"),$AE69,AL$2),\"\")","v":""},{"$f":"IF($AE69<>\"\",INDEX(INDIRECT(\"'\"&$AD69&\"'!$B$7:$I$100\"),$AE69,AM$2),\"\")","v":""},{"$f":"IF($AE69<>\"\",INDEX(INDIRECT(\"'\"&$AD69&\"'!$B$7:$I$100\"),$AE69,AN$2),\"\")","v":""},null,null,null,null,null,null,null,null,null,null,null,{"$f":"IFERROR( INDIRECT(\"'\"&$W69&\"'!$B$4\"), \"\")","v":""},"S67","",false,{"$error":"#VALUE!"},"S67",null,67,{"$f":"VLOOKUP(AC69,$Z$3:$AA107,2)","v":"S1"},{"$f":"IF(VLOOKUP(AD69,$W$3:$AD$102,3,FALSE)=TRUE,IF(AD69=AD68,AE68+1,1),\"\")","v":""}]
[null,"",{"$f":"IF($AE70<>\"\",INDEX(INDIRECT(\"'\"&$AD70&\"'!$B$7:$I$100\"),$AE70,AG$2),\"\")","v":""},{"$f":"IF($AE70<>\"\",INDEX(INDIRECT(\"'\"&$AD70&\"'!$B$7:$I$100\"),$AE70,AH$2),\"\")","v":""},{"$f":"IF($AE70<>\"\",INDEX(INDIRECT(\"'\"&$AD70&\"'!$B$7:$I$100\"),$AE70,AI$2),\"\")","v":""},{"$f":"IF($AE70<>\"\",INDEX(INDIRECT(\"'\"&$AD70&\"'!$B$7:$I$100\"),$AE70,AJ$2),\"\")","v":""},{"$f":"IF($AE70<>\"\",INDEX(INDIRECT(\"'\"&$AD70&\"'!$B$7:$I$100\"),$AE70,AK$2),\"\")","v":""},{"$f":"IF($AE70<>\"\",INDEX(INDIRECT(\"'\"&$AD70&\"'!$B$7:$I$100\"),$AE70,AL$2),\"\")","v":""},{"$f":"IF($AE70<>\"\",INDEX(INDIRECT(\"'\"&$AD70&\"'!$B$7:$I$100\"),$AE70,AM$2),\"\")","v":""},{"$f":"IF($AE70<>\"\",INDEX(INDIRECT(\"'\"&$AD70&\"'!$B$7:$I$100\"),$AE70,AN$2),\"\")","v":""},null,null,null,null,null,null,null,null,null,null,null,{"$f":"IFERROR( INDIRECT(\"'\"&$W70&\"'!$B$4\"), \"\")","v":""},"S68","",false,{"$error":"#VALUE!"},"S68",null,68,{"$f":"VLOOKUP(AC70,$Z$3:$AA108,2)","v":"S1"},""]
[null,"",{"$f":"IF($AE71<>\"\",INDEX(INDIRECT(\"'\"&$AD71&\"'!$B$7:$I$100\"),$AE71,AG$2),\"\")","v":""},{"$f":"IF($AE71<>\"\",INDEX(INDIRECT(\"'\"&$AD71&\"'!$B$7:$I$100\"),$AE71,AH$2),\"\")","v":""},{"$f":"IF($AE71<>\"\",INDEX(INDIRECT(\"'\"&$AD71&\"'!$B$7:$I$100\"),$AE71,AI$2),\"\")","v":""},{"$f":"IF($AE71<>\"\",INDEX(INDIRECT(\"'\"&$AD71&\"'!$B$7:$I$100\"),$AE71,AJ$2),\"\")","v":""},{"$f":"IF($AE71<>\"\",INDEX(INDIRECT(\"'\"&$AD71&\"'!$B$7:$I$100\"),$AE71,AK$2),\"\")","v":""},{"$f":"IF($AE71<>\"\",INDEX(INDIRECT(\"'\"&$AD71&\"'!$B$7:$I$100\"),$AE71,AL$2),\"\")","v":""},{"$f":"IF($AE71<>\"\",INDEX(INDIRECT(\"'\"&$AD71&\"'!$B$7:$I$100\"),$AE71,AM$2),\"\")","v":""},{"$f":"IF($AE71<>\"\",INDEX(INDIRECT(\"'\"&$AD71&\"'!$B$7:$I$100\"),$AE71,AN$2),\"\")","v":""},null,null,null,null,null,null,null,null,null,null,null,{"$f":"IFERROR( INDIRECT(\"'\"&$W71&\"'!$B$4\"), \"\")","v":""},"S69","",false,{"$error":"#VALUE!"},"S69",null,69,{"$f":"VLOOKUP(AC71,$Z$3:$AA109,2)","v":"S1"},""]
[null,"",{"$f":"IF($AE72<>\"\",INDEX(INDIRECT(\"'\"&$AD72&\"'!$B$7:$I$100\"),$AE72,AG$2),\"\")","v":""},{"$f":"IF($AE72<>\"\",INDEX(INDIRECT(\"'\"&$AD72&\"'!$B$7:$I$100\"),$AE72,AH$2),\"\")","v":""},{"$f":"IF($AE72<>\"\",INDEX(INDIRECT(\"'\"&$AD72&\"'!$B$7:$I$100\"),$AE72,AI$2),\"\")","v":""},{"$f":"IF($AE72<>\"\",INDEX(INDIRECT(\"'\"&$AD72&\"'!$B$7:$I$100\"),$AE72,AJ$2),\"\")","v":""},{"$f":"IF($AE72<>\"\",INDEX(INDIRECT(\"'\"&$AD72&\"'!$B$7:$I$100\"),$AE72,AK$2),\"\")","v":""},{"$f":"IF($AE72<>\"\",INDEX(INDIRECT(\"'\"&$AD72&\"'!$B$7:$I$100\"),$AE72,AL$2),\"\")","v":""},{"$f":"IF($AE72<>\"\",INDEX(INDIRECT(\"'\"&$AD72&\"'!$B$7:$I$100\"),$AE72,AM$2),\"\")","v":""},{"$f":"IF($AE72<>\"\",INDEX(INDIRECT(\"'\"&$AD72&\"'!$B$7:$I$100\"),$AE72,AN$2),\"\")","v":""},null,null,null,null,null,null,null,null,null,null,null,{"$f":"IFERROR( INDIRECT(\"'\"&$W72&\"'!$B$4\"), \"\")","v":""},"S70","",false,{"$error":"#VALUE!"},"S70",null,70,{"$f":"VLOOKUP(AC72,$Z$3:$AA110,2)","v":"S1"},""]
[null,"",{"$f":"IF($AE73<>\"\",INDEX(INDIRECT(\"'\"&$AD73&\"'!$B$7:$I$100\"),$AE73,AG$2),\"\")","v":""},{"$f":"IF($AE73<>\"\",INDEX(INDIRECT(\"'\"&$AD73&\"'!$B$7:$I$100\"),$AE73,AH$2),\"\")","v":""},{"$f":"IF($AE73<>\"\",INDEX(INDIRECT(\"'\"&$AD73&\"'!$B$7:$I$100\"),$AE73,AI$2),\"\")","v":""},{"$f":"IF($AE73<>\"\",INDEX(INDIRECT(\"'\"&$AD73&\"'!$B$7:$I$100\"),$AE73,AJ$2),\"\")","v":""},{"$f":"IF($AE73<>\"\",INDEX(INDIRECT(\"'\"&$AD73&\"'!$B$7:$I$100\"),$AE73,AK$2),\"\")","v":""},{"$f":"IF($AE73<>\"\",INDEX(INDIRECT(\"'\"&$AD73&\"'!$B$7:$I$100\"),$AE73,AL$2),\"\")","v":""},{"$f":"IF($AE73<>\"\",INDEX(INDIRECT(\"'\"&$AD73&\"'!$B$7:$I$100\"),$AE73,AM$2),\"\")","v":""},{"$f":"IF($AE73<>\"\",INDEX(INDIRECT(\"'\"&$AD73&\"'!$B$7:$I$100\"),$AE73,AN$2),\"\")","v":""},null,null,null,null,null,null,null,null,null,null,null,{"$f":"IFERROR( INDIRECT(\"'\"&$W73&\"'!$B$4\"), \"\")","v":""},"S71","",false,{"$error":"#VALUE!"},"S71",null,71,{"$f":"VLOOKUP(AC73,$Z$3:$AA111,2)","v":"S1"},""]
[null,"",{"$f":"IF($AE74<>\"\",INDEX(INDIRECT(\"'\"&$AD74&\"'!$B$7:$I$100\"),$AE74,AG$2),\"\")","v":""},{"$f":"IF($AE74<>\"\",INDEX(INDIRECT(\"'\"&$AD74&\"'!$B$7:$I$100\"),$AE74,AH$2),\"\")","v":""},{"$f":"IF($AE74<>\"\",INDEX(INDIRECT(\"'\"&$AD74&\"'!$B$7:$I$100\"),$AE74,AI$2),\"\")","v":""},{"$f":"IF($AE74<>\"\",INDEX(INDIRECT(\"'\"&$AD74&\"'!$B$7:$I$100\"),$AE74,AJ$2),\"\")","v":""},{"$f":"IF($AE74<>\"\",INDEX(INDIRECT(\"'\"&$AD74&\"'!$B$7:$I$100\"),$AE74,AK$2),\"\")","v":""},{"$f":"IF($AE74<>\"\",INDEX(INDIRECT(\"'\"&$AD74&\"'!$B$7:$I$100\"),$AE74,AL$2),\"\")","v":""},{"$f":"IF($AE74<>\"\",INDEX(INDIRECT(\"'\"&$AD74&\"'!$B$7:$I$100\"),$AE74,AM$2),\"\")","v":""},{"$f":"IF($AE74<>\"\",INDEX(INDIRECT(\"'\"&$AD74&\"'!$B$7:$I$100\"),$AE74,AN$2),\"\")","v":""},null,null,null,null,null,null,null,null,null,null,null,{"$f":"IFERROR( INDIRECT(\"'\"&$W74&\"'!$B$4\"), \"\")","v":""},"S72","",false,{"$error":"#VALUE!"},"S72",null,72,{"$f":"VLOOKUP(AC74,$Z$3:$AA112,2)","v":"S1"},""]
[null,"",{"$f":"IF($AE75<>\"\",INDEX(INDIRECT(\"'\"&$AD75&\"'!$B$7:$I$100\"),$AE75,AG$2),\"\")","v":""},{"$f":"IF($AE75<>\"\",INDEX(INDIRECT(\"'\"&$AD75&\"'!$B$7:$I$100\"),$AE75,AH$2),\"\")","v":""},{"$f":"IF($AE75<>\"\",INDEX(INDIRECT(\"'\"&$AD75&\"'!$B$7:$I$100\"),$AE75,AI$2),\"\")","v":""},{"$f":"IF($AE75<>\"\",INDEX(INDIRECT(\"'\"&$AD75&\"'!$B$7:$I$100\"),$AE75,AJ$2),\"\")","v":""},{"$f":"IF($AE75<>\"\",INDEX(INDIRECT(\"'\"&$AD75&\"'!$B$7:$I$100\"),$AE75,AK$2),\"\")","v":""},{"$f":"IF($AE75<>\"\",INDEX(INDIRECT(\"'\"&$AD75&\"'!$B$7:$I$100\"),$AE75,AL$2),\"\")","v":""},{"$f":"IF($AE75<>\"\",INDEX(INDIRECT(\"'\"&$AD75&\"'!$B$7:$I$100\"),$AE75,AM$2),\"\")","v":""},{"$f":"IF($AE75<>\"\",INDEX(INDIRECT(\"'\"&$AD75&\"'!$B$7:$I$100\"),$AE75,AN$2),\"\")","v":""},null,null,null,null,null,null,null,null,null,null,null,{"$f":"IFERROR( INDIRECT(\"'\"&$W75&\"'!$B$4\"), \"\")","v":""},"S73","",false,{"$error":"#VALUE!"},"S73",null,73,{"$f":"VLOOKUP(AC75,$Z$3:$AA113,2)","v":"S1"},""]
[null,"",{"$f":"IF($AE76<>\"\",INDEX(INDIRECT(\"'\"&$AD76&\"'!$B$7:$I$100\"),$AE76,AG$2),\"\")","v":""},{"$f":"IF($AE76<>\"\",INDEX(INDIRECT(\"'\"&$AD76&\"'!$B$7:$I$100\"),$AE76,AH$2),\"\")","v":""},{"$f":"IF($AE76<>\"\",INDEX(INDIRECT(\"'\"&$AD76&\"'!$B$7:$I$100\"),$AE76,AI$2),\"\")","v":""},{"$f":"IF($AE76<>\"\",INDEX(INDIRECT(\"'\"&$AD76&\"'!$B$7:$I$100\"),$AE76,AJ$2),\"\")","v":""},{"$f":"IF($AE76<>\"\",INDEX(INDIRECT(\"'\"&$AD76&\"'!$B$7:$I$100\"),$AE76,AK$2),\"\")","v":""},{"$f":"IF($AE76<>\"\",INDEX(INDIRECT(\"'\"&$AD76&\"'!$B$7:$I$100\"),$AE76,AL$2),\"\")","v":""},{"$f":"IF($AE76<>\"\",INDEX(INDIRECT(\"'\"&$AD76&\"'!$B$7:$I$100\"),$AE76,AM$2),\"\")","v":""},{"$f":"IF($AE76<>\"\",INDEX(INDIRECT(\"'\"&$AD76&\"'!$B$7:$I$100\"),$AE76,AN$2),\"\")","v":""},null,null,null,null,null,null,null,null,null,null,null,{"$f":"IFERROR( INDIRECT(\"'\"&$W76&\"'!$B$4\"), \"\")","v":""},"S74","",false,{"$error":"#VALUE!"},"S74",null,74,{"$f":"VLOOKUP(AC76,$Z$3:$AA114,2)","v":"S1"},""]
[null,"",{"$f":"IF($AE77<>\"\",INDEX(INDIRECT(\"'\"&$AD77&\"'!$B$7:$I$100\"),$AE77,AG$2),\"\")","v":""},{"$f":"IF($AE77<>\"\",INDEX(INDIRECT(\"'\"&$AD77&\"'!$B$7:$I$100\"),$AE77,AH$2),\"\")","v":""},{"$f":"IF($AE77<>\"\",INDEX(INDIRECT(\"'\"&$AD77&\"'!$B$7:$I$100\"),$AE77,AI$2),\"\")","v":""},{"$f":"IF($AE77<>\"\",INDEX(INDIRECT(\"'\"&$AD77&\"'!$B$7:$I$100\"),$AE77,AJ$2),\"\")","v":""},{"$f":"IF($AE77<>\"\",INDEX(INDIRECT(\"'\"&$AD77&\"'!$B$7:$I$100\"),$AE77,AK$2),\"\")","v":""},{"$f":"IF($AE77<>\"\",INDEX(INDIRECT(\"'\"&$AD77&\"'!$B$7:$I$100\"),$AE77,AL$2),\"\")","v":""},{"$f":"IF($AE77<>\"\",INDEX(INDIRECT(\"'\"&$AD77&\"'!$B$7:$I$100\"),$AE77,AM$2),\"\")","v":""},{"$f":"IF($AE77<>\"\",INDEX(INDIRECT(\"'\"&$AD77&\"'!$B$7:$I$100\"),$AE77,AN$2),\"\")","v":""},null,null,null,null,null,null,null,null,null,null,null,{"$f":"IFERROR( INDIRECT(\"'\"&$W77&\"'!$B$4\"), \"\")","v":""},"S75","",false,{"$error":"#VALUE!"},"S75",null,75,{"$f":"VLOOKUP(AC77,$Z$3:$AA115,2)","v":"S1"},""]
[null,"",{"$f":"IF($AE78<>\"\",INDEX(INDIRECT(\"'\"&$AD78&\"'!$B$7:$I$100\"),$AE78,AG$2),\"\")","v":""},{"$f":"IF($AE78<>\"\",INDEX(INDIRECT(\"'\"&$AD78&\"'!$B$7:$I$100\"),$AE78,AH$2),\"\")","v":""},{"$f":"IF($AE78<>\"\",INDEX(INDIRECT(\"'\"&$AD78&\"'!$B$7:$I$100\"),$AE78,AI$2),\"\")","v":""},{"$f":"IF($AE78<>\"\",INDEX(INDIRECT(\"'\"&$AD78&\"'!$B$7:$I$100\"),$AE78,AJ$2),\"\")","v":""},{"$f":"IF($AE78<>\"\",INDEX(INDIRECT(\"'\"&$AD78&\"'!$B$7:$I$100\"),$AE78,AK$2),\"\")","v":""},{"$f":"IF($AE78<>\"\",INDEX(INDIRECT(\"'\"&$AD78&\"'!$B$7:$I$100\"),$AE78,AL$2),\"\")","v":""},{"$f":"IF($AE78<>\"\",INDEX(INDIRECT(\"'\"&$AD78&\"'!$B$7:$I$100\"),$AE78,AM$2),\"\")","v":""},{"$f":"IF($AE78<>\"\",INDEX(INDIRECT(\"'\"&$AD78&\"'!$B$7:$I$100\"),$AE78,AN$2),\"\")","v":""},null,null,null,null,null,null,null,null,null,null,null,{"$f":"IFERROR( INDIRECT(\"'\"&$W78&\"'!$B$4\"), \"\")","v":""},"S76","",false,{"$error":"#VALUE!"},"S76",null,76,{"$f":"VLOOKUP(AC78,$Z$3:$AA116,2)","v":"S1"},""]
[null,"",{"$f":"IF($AE79<>\"\",INDEX(INDIRECT(\"'\"&$AD79&\"'!$B$7:$I$100\"),$AE79,AG$2),\"\")","v":""},{"$f":"IF($AE79<>\"\",INDEX(INDIRECT(\"'\"&$AD79&\"'!$B$7:$I$100\"),$AE79,AH$2),\"\")","v":""},{"$f":"IF($AE79<>\"\",INDEX(INDIRECT(\"'\"&$AD79&\"'!$B$7:$I$100\"),$AE79,AI$2),\"\")","v":""},{"$f":"IF($AE79<>\"\",INDEX(INDIRECT(\"'\"&$AD79&\"'!$B$7:$I$100\"),$AE79,AJ$2),\"\")","v":""},{"$f":"IF($AE79<>\"\",INDEX(INDIRECT(\"'\"&$AD79&\"'!$B$7:$I$100\"),$AE79,AK$2),\"\")","v":""},{"$f":"IF($AE79<>\"\",INDEX(INDIRECT(\"'\"&$AD79&\"'!$B$7:$I$100\"),$AE79,AL$2),\"\")","v":""},{"$f":"IF($AE79<>\"\",INDEX(INDIRECT(\"'\"&$AD79&\"'!$B$7:$I$100\"),$AE79,AM$2),\"\")","v":""},{"$f":"IF($AE79<>\"\",INDEX(INDIRECT(\"'\"&$AD79&\"'!$B$7:$I$100\"),$AE79,AN$2),\"\")","v":""},null,null,null,null,null,null,null,null,null,null,null,{"$f":"IFERROR( INDIRECT(\"'\"&$W79&\"'!$B$4\"), \"\")","v":""},"S77","",false,{"$error":"#VALUE!"},"S77",null,77,{"$f":"VLOOKUP(AC79,$Z$3:$AA117,2)","v":"S1"},""]
[null,"",{"$f":"IF($AE80<>\"\",INDEX(INDIRECT(\"'\"&$AD80&\"'!$B$7:$I$100\"),$AE80,AG$2),\"\")","v":""},{"$f":"IF($AE80<>\"\",INDEX(INDIRECT(\"'\"&$AD80&\"'!$B$7:$I$100\"),$AE80,AH$2),\"\")","v":""},{"$f":"IF($AE80<>\"\",INDEX(INDIRECT(\"'\"&$AD80&\"'!$B$7:$I$100\"),$AE80,AI$2),\"\")","v":""},{"$f":"IF($AE80<>\"\",INDEX(INDIRECT(\"'\"&$AD80&\"'!$B$7:$I$100\"),$AE80,AJ$2),\"\")","v":""},{"$f":"IF($AE80<>\"\",INDEX(INDIRECT(\"'\"&$AD80&\"'!$B$7:$I$100\"),$AE80,AK$2),\"\")","v":""},{"$f":"IF($AE80<>\"\",INDEX(INDIRECT(\"'\"&$AD80&\"'!$B$7:$I$100\"),$AE80,AL$2),\"\")","v":""},{"$f":"IF($AE80<>\"\",INDEX(INDIRECT(\"'\"&$AD80&\"'!$B$7:$I$100\"),$AE80,AM$2),\"\")","v":""},{"$f":"IF($AE80<>\"\",INDEX(INDIRECT(\"'\"&$AD80&\"'!$B$7:$I$100\"),$AE80,AN$2),\"\")","v":""},null,null,null,null,null,null,null,null,null,null,null,{"$f":"IFERROR( INDIRECT(\"'\"&$W80&\"'!$B$4\"), \"\")","v":""},"S78","",false,{"$error":"#VALUE!"},"S78",null,78,{"$f":"VLOOKUP(AC80,$Z$3:$AA118,2)","v":"S1"},""]
[null,"",{"$f":"IF($AE81<>\"\",INDEX(INDIRECT(\"'\"&$AD81&\"'!$B$7:$I$100\"),$AE81,AG$2),\"\")","v":""},{"$f":"IF($AE81<>\"\",INDEX(INDIRECT(\"'\"&$AD81&\"'!$B$7:$I$100\"),$AE81,AH$2),\"\")","v":""},{"$f":"IF($AE81<>\"\",INDEX(INDIRECT(\"'\"&$AD81&\"'!$B$7:$I$100\"),$AE81,AI$2),\"\")","v":""},{"$f":"IF($AE81<>\"\",INDEX(INDIRECT(\"'\"&$AD81&\"'!$B$7:$I$100\"),$AE81,AJ$2),\"\")","v":""},{"$f":"IF($AE81<>\"\",INDEX(INDIRECT(\"'\"&$AD81&\"'!$B$7:$I$100\"),$AE81,AK$2),\"\")","v":""},{"$f":"IF($AE81<>\"\",INDEX(INDIRECT(\"'\"&$AD81&\"'!$B$7:$I$100\"),$AE81,AL$2),\"\")","v":""},{"$f":"IF($AE81<>\"\",INDEX(INDIRECT(\"'\"&$AD81&\"'!$B$7:$I$100\"),$AE81,AM$2),\"\")","v":""},{"$f":"IF($AE81<>\"\",INDEX(INDIRECT(\"'\"&$AD81&\"'!$B$7:$I$100\"),$AE81,AN$2),\"\")","v":""},null,null,null,null,null,null,null,null,null,null,null,{"$f":"IFERROR( INDIRECT(\"'\"&$W81&\"'!$B$4\"), \"\")","v":""},"S79","",false,{"$error":"#VALUE!"},"S79",null,79,{"$f":"VLOOKUP(AC81,$Z$3:$AA119,2)","v":"S1"},""]
[null,"",{"$f":"IF($AE82<>\"\",INDEX(INDIRECT(\"'\"&$AD82&\"'!$B$7:$I$100\"),$AE82,AG$2),\"\")","v":""},{"$f":"IF($AE82<>\"\",INDEX(INDIRECT(\"'\"&$AD82&\"'!$B$7:$I$100\"),$AE82,AH$2),\"\")","v":""},{"$f":"IF($AE82<>\"\",INDEX(INDIRECT(\"'\"&$AD82&\"'!$B$7:$I$100\"),$AE82,AI$2),\"\")","v":""},{"$f":"IF($AE82<>\"\",INDEX(INDIRECT(\"'\"&$AD82&\"'!$B$7:$I$100\"),$AE82,AJ$2),\"\")","v":""},{"$f":"IF($AE82<>\"\",INDEX(INDIRECT(\"'\"&$AD82&\"'!$B$7:$I$100\"),$AE82,AK$2),\"\")","v":""},{"$f":"IF($AE82<>\"\",INDEX(INDIRECT(\"'\"&$AD82&\"'!$B$7:$I$100\"),$AE82,AL$2),\"\")","v":""},{"$f":"IF($AE82<>\"\",INDEX(INDIRECT(\"'\"&$AD82&\"'!$B$7:$I$100\"),$AE82,AM$2),\"\")","v":""},{"$f":"IF($AE82<>\"\",INDEX(INDIRECT(\"'\"&$AD82&\"'!$B$7:$I$100\"),$AE82,AN$2),\"\")","v":""},null,null,null,null,null,null,null,null,null,null,null,{"$f":"IFERROR( INDIRECT(\"'\"&$W82&\"'!$B$4\"), \"\")","v":""},"S80","",false,{"$error":"#VALUE!"},"S80",null,80,{"$f":"VLOOKUP(AC82,$Z$3:$AA120,2)","v":"S1"},""]
[null,"",{"$f":"IF($AE83<>\"\",INDEX(INDIRECT(\"'\"&$AD83&\"'!$B$7:$I$100\"),$AE83,AG$2),\"\")","v":""},{"$f":"IF($AE83<>\"\",INDEX(INDIRECT(\"'\"&$AD83&\"'!$B$7:$I$100\"),$AE83,AH$2),\"\")","v":""},{"$f":"IF($AE83<>\"\",INDEX(INDIRECT(\"'\"&$AD83&\"'!$B$7:$I$100\"),$AE83,AI$2),\"\")","v":""},{"$f":"IF($AE83<>\"\",INDEX(INDIRECT(\"'\"&$AD83&\"'!$B$7:$I$100\"),$AE83,AJ$2),\"\")","v":""},{"$f":"IF($AE83<>\"\",INDEX(INDIRECT(\"'\"&$AD83&\"'!$B$7:$I$100\"),$AE83,AK$2),\"\")","v":""},{"$f":"IF($AE83<>\"\",INDEX(INDIRECT(\"'\"&$AD83&\"'!$B$7:$I$100\"),$AE83,AL$2),\"\")","v":""},{"$f":"IF($AE83<>\"\",INDEX(INDIRECT(\"'\"&$AD83&\"'!$B$7:$I$100\"),$AE83,AM$2),\"\")","v":""},{"$f":"IF($AE83<>\"\",INDEX(INDIRECT(\"'\"&$AD83&\"'!$B$7:$I$100\"),$AE83,AN$2),\"\")","v":""},null,null,null,null,null,null,null,null,null,null,null,{"$f":"IFERROR( INDIRECT(\"'\"&$W83&\"'!$B$4\"), \"\")","v":""},"S81","",false,{"$error":"#VALUE!"},"S81",null,81,{"$f":"VLOOKUP(AC83,$Z$3:$AA121,2)","v":"S1"},""]
[null,"",{"$f":"IF($AE84<>\"\",INDEX(INDIRECT(\"'\"&$AD84&\"'!$B$7:$I$100\"),$AE84,AG$2),\"\")","v":""},{"$f":"IF($AE84<>\"\",INDEX(INDIRECT(\"'\"&$AD84&\"'!$B$7:$I$100\"),$AE84,AH$2),\"\")","v":""},{"$f":"IF($AE84<>\"\",INDEX(INDIRECT(\"'\"&$AD84&\"'!$B$7:$I$100\"),$AE84,AI$2),\"\")","v":""},{"$f":"IF($AE84<>\"\",INDEX(INDIRECT(\"'\"&$AD84&\"'!$B$7:$I$100\"),$AE84,AJ$2),\"\")","v":""},{"$f":"IF($AE84<>\"\",INDEX(INDIRECT(\"'\"&$AD84&\"'!$B$7:$I$100\"),$AE84,AK$2),\"\")","v":""},{"$f":"IF($AE84<>\"\",INDEX(INDIRECT(\"'\"&$AD84&\"'!$B$7:$I$100\"),$AE84,AL$2),\"\")","v":""},{"$f":"IF($AE84<>\"\",INDEX(INDIRECT(\"'\"&$AD84&\"'!$B$7:$I$100\"),$AE84,AM$2),\"\")","v":""},{"$f":"IF($AE84<>\"\",INDEX(INDIRECT(\"'\"&$AD84&\"'!$B$7:$I$100\"),$AE84,AN$2),\"\")","v":""},null,null,null,null,null,null,null,null,null,null,null,{"$f":"IFERROR( INDIRECT(\"'\"&$W84&\"'!$B$4\"), \"\")","v":""},"S82","",false,{"$error":"#VALUE!"},"S82",null,82,{"$f":"VLOOKUP(AC84,$Z$3:$AA122,2)","v":"S1"},""]
[null,"",{"$f":"IF($AE85<>\"\",INDEX(INDIRECT(\"'\"&$AD85&\"'!$B$7:$I$100\"),$AE85,AG$2),\"\")","v":""},{"$f":"IF($AE85<>\"\",INDEX(INDIRECT(\"'\"&$AD85&\"'!$B$7:$I$100\"),$AE85,AH$2),\"\")","v":""},{"$f":"IF($AE85<>\"\",INDEX(INDIRECT(\"'\"&$AD85&\"'!$B$7:$I$100\"),$AE85,AI$2),\"\")","v":""},{"$f":"IF($AE85<>\"\",INDEX(INDIRECT(\"'\"&$AD85&\"'!$B$7:$I$100\"),$AE85,AJ$2),\"\")","v":""},{"$f":"IF($AE85<>\"\",INDEX(INDIRECT(\"'\"&$AD85&\"'!$B$7:$I$100\"),$AE85,AK$2),\"\")","v":""},{"$f":"IF($AE85<>\"\",INDEX(INDIRECT(\"'\"&$AD85&\"'!$B$7:$I$100\"),$AE85,AL$2),\"\")","v":""},{"$f":"IF($AE85<>\"\",INDEX(INDIRECT(\"'\"&$AD85&\"'!$B$7:$I$100\"),$AE85,AM$2),\"\")","v":""},{"$f":"IF($AE85<>\"\",INDEX(INDIRECT(\"'\"&$AD85&\"'!$B$7:$I$100\"),$AE85,AN$2),\"\")","v":""},null,null,null,null,null,null,null,null,null,null,null,{"$f":"IFERROR( INDIRECT(\"'\"&$W85&\"'!$B$4\"), \"\")","v":""},"S83","",false,{"$error":"#VALUE!"},"S83",null,83,{"$f":"VLOOKUP(AC85,$Z$3:$AA123,2)","v":"S1"},""]
[null,"",{"$f":"IF($AE86<>\"\",INDEX(INDIRECT(\"'\"&$AD86&\"'!$B$7:$I$100\"),$AE86,AG$2),\"\")","v":""},{"$f":"IF($AE86<>\"\",INDEX(INDIRECT(\"'\"&$AD86&\"'!$B$7:$I$100\"),$AE86,AH$2),\"\")","v":""},{"$f":"IF($AE86<>\"\",INDEX(INDIRECT(\"'\"&$AD86&\"'!$B$7:$I$100\"),$AE86,AI$2),\"\")","v":""},{"$f":"IF($AE86<>\"\",INDEX(INDIRECT(\"'\"&$AD86&\"'!$B$7:$I$100\"),$AE86,AJ$2),\"\")","v":""},{"$f":"IF($AE86<>\"\",INDEX(INDIRECT(\"'\"&$AD86&\"'!$B$7:$I$100\"),$AE86,AK$2),\"\")","v":""},{"$f":"IF($AE86<>\"\",INDEX(INDIRECT(\"'\"&$AD86&\"'!$B$7:$I$100\"),$AE86,AL$2),\"\")","v":""},{"$f":"IF($AE86<>\"\",INDEX(INDIRECT(\"'\"&$AD86&\"'!$B$7:$I$100\"),$AE86,AM$2),\"\")","v":""},{"$f":"IF($AE86<>\"\",INDEX(INDIRECT(\"'\"&$AD86&\"'!$B$7:$I$100\"),$AE86,AN$2),\"\")","v":""},null,null,null,null,null,null,null,null,null,null,null,{"$f":"IFERROR( INDIRECT(\"'\"&$W86&\"'!$B$4\"), \"\")","v":""},"S84","",false,{"$error":"#VALUE!"},"S84",null,84,{"$f":"VLOOKUP(AC86,$Z$3:$AA124,2)","v":"S1"},""]
[null,"",{"$f":"IF($AE87<>\"\",INDEX(INDIRECT(\"'\"&$AD87&\"'!$B$7:$I$100\"),$AE87,AG$2),\"\")","v":""},{"$f":"IF($AE87<>\"\",INDEX(INDIRECT(\"'\"&$AD87&\"'!$B$7:$I$100\"),$AE87,AH$2),\"\")","v":""},{"$f":"IF($AE87<>\"\",INDEX(INDIRECT(\"'\"&$AD87&\"'!$B$7:$I$100\"),$AE87,AI$2),\"\")","v":""},{"$f":"IF($AE87<>\"\",INDEX(INDIRECT(\"'\"&$AD87&\"'!$B$7:$I$100\"),$AE87,AJ$2),\"\")","v":""},{"$f":"IF($AE87<>\"\",INDEX(INDIRECT(\"'\"&$AD87&\"'!$B$7:$I$100\"),$AE87,AK$2),\"\")","v":""},{"$f":"IF($AE87<>\"\",INDEX(INDIRECT(\"'\"&$AD87&\"'!$B$7:$I$100\"),$AE87,AL$2),\"\")","v":""},{"$f":"IF($AE87<>\"\",INDEX(INDIRECT(\"'\"&$AD87&\"'!$B$7:$I$100\"),$AE87,AM$2),\"\")","v":""},{"$f":"IF($AE87<>\"\",INDEX(INDIRECT(\"'\"&$AD87&\"'!$B$7:$I$100\"),$AE87,AN$2),\"\")","v":""},null,null,null,null,null,null,null,null,null,null,null,{"$f":"IFERROR( INDIRECT(\"'\"&$W87&\"'!$B$4\"), \"\")","v":""},"S85","",false,{"$error":"#VALUE!"},"S85",null,85,{"$f":"VLOOKUP(AC87,$Z$3:$AA125,2)","v":"S1"},""]
[null,"",{"$f":"IF($AE88<>\"\",INDEX(INDIRECT(\"'\"&$AD88&\"'!$B$7:$I$100\"),$AE88,AG$2),\"\")","v":""},{"$f":"IF($AE88<>\"\",INDEX(INDIRECT(\"'\"&$AD88&\"'!$B$7:$I$100\"),$AE88,AH$2),\"\")","v":""},{"$f":"IF($AE88<>\"\",INDEX(INDIRECT(\"'\"&$AD88&\"'!$B$7:$I$100\"),$AE88,AI$2),\"\")","v":""},{"$f":"IF($AE88<>\"\",INDEX(INDIRECT(\"'\"&$AD88&\"'!$B$7:$I$100\"),$AE88,AJ$2),\"\")","v":""},{"$f":"IF($AE88<>\"\",INDEX(INDIRECT(\"'\"&$AD88&\"'!$B$7:$I$100\"),$AE88,AK$2),\"\")","v":""},{"$f":"IF($AE88<>\"\",INDEX(INDIRECT(\"'\"&$AD88&\"'!$B$7:$I$100\"),$AE88,AL$2),\"\")","v":""},{"$f":"IF($AE88<>\"\",INDEX(INDIRECT(\"'\"&$AD88&\"'!$B$7:$I$100\"),$AE88,AM$2),\"\")","v":""},{"$f":"IF($AE88<>\"\",INDEX(INDIRECT(\"'\"&$AD88&\"'!$B$7:$I$100\"),$AE88,AN$2),\"\")","v":""},null,null,null,null,null,null,null,null,null,null,null,{"$f":"IFERROR( INDIRECT(\"'\"&$W88&\"'!$B$4\"), \"\")","v":""},"S86","",false,{"$error":"#VALUE!"},"S86",null,86,{"$f":"VLOOKUP(AC88,$Z$3:$AA126,2)","v":"S1"},""]
[null,"",{"$f":"IF($AE89<>\"\",INDEX(INDIRECT(\"'\"&$AD89&\"'!$B$7:$I$100\"),$AE89,AG$2),\"\")","v":""},{"$f":"IF($AE89<>\"\",INDEX(INDIRECT(\"'\"&$AD89&\"'!$B$7:$I$100\"),$AE89,AH$2),\"\")","v":""},{"$f":"IF($AE89<>\"\",INDEX(INDIRECT(\"'\"&$AD89&\"'!$B$7:$I$100\"),$AE89,AI$2),\"\")","v":""},{"$f":"IF($AE89<>\"\",INDEX(INDIRECT(\"'\"&$AD89&\"'!$B$7:$I$100\"),$AE89,AJ$2),\"\")","v":""},{"$f":"IF($AE89<>\"\",INDEX(INDIRECT(\"'\"&$AD89&\"'!$B$7:$I$100\"),$AE89,AK$2),\"\")","v":""},{"$f":"IF($AE89<>\"\",INDEX(INDIRECT(\"'\"&$AD89&\"'!$B$7:$I$100\"),$AE89,AL$2),\"\")","v":""},{"$f":"IF($AE89<>\"\",INDEX(INDIRECT(\"'\"&$AD89&\"'!$B$7:$I$100\"),$AE89,AM$2),\"\")","v":""},{"$f":"IF($AE89<>\"\",INDEX(INDIRECT(\"'\"&$AD89&\"'!$B$7:$I$100\"),$AE89,AN$2),\"\")","v":""},null,null,null,null,null,null,null,null,null,null,null,{"$f":"IFERROR( INDIRECT(\"'\"&$W89&\"'!$B$4\"), \"\")","v":""},"S87","",false,{"$error":"#VALUE!"},"S87",null,87,{"$f":"VLOOKUP(AC89,$Z$3:$AA127,2)","v":"S1"},""]
[null,"",{"$f":"IF($AE90<>\"\",INDEX(INDIRECT(\"'\"&$AD90&\"'!$B$7:$I$100\"),$AE90,AG$2),\"\")","v":""},{"$f":"IF($AE90<>\"\",INDEX(INDIRECT(\"'\"&$AD90&\"'!$B$7:$I$100\"),$AE90,AH$2),\"\")","v":""},{"$f":"IF($AE90<>\"\",INDEX(INDIRECT(\"'\"&$AD90&\"'!$B$7:$I$100\"),$AE90,AI$2),\"\")","v":""},{"$f":"IF($AE90<>\"\",INDEX(INDIRECT(\"'\"&$AD90&\"'!$B$7:$I$100\"),$AE90,AJ$2),\"\")","v":""},{"$f":"IF($AE90<>\"\",INDEX(INDIRECT(\"'\"&$AD90&\"'!$B$7:$I$100\"),$AE90,AK$2),\"\")","v":""},{"$f":"IF($AE90<>\"\",INDEX(INDIRECT(\"'\"&$AD90&\"'!$B$7:$I$100\"),$AE90,AL$2),\"\")","v":""},{"$f":"IF($AE90<>\"\",INDEX(INDIRECT(\"'\"&$AD90&\"'!$B$7:$I$100\"),$AE90,AM$2),\"\")","v":""},{"$f":"IF($AE90<>\"\",INDEX(INDIRECT(\"'\"&$AD90&\"'!$B$7:$I$100\"),$AE90,AN$2),\"\")","v":""},null,null,null,null,null,null,null,null,null,null,null,{"$f":"IFERROR( INDIRECT(\"'\"&$W90&\"'!$B$4\"), \"\")","v":""},"S88","",false,{"$error":"#VALUE!"},"S88",null,88,{"$f":"VLOOKUP(AC90,$Z$3:$AA128,2)","v":"S1"},""]
[null,"",{"$f":"IF($AE91<>\"\",INDEX(INDIRECT(\"'\"&$AD91&\"'!$B$7:$I$100\"),$AE91,AG$2),\"\")","v":""},{"$f":"IF($AE91<>\"\",INDEX(INDIRECT(\"'\"&$AD91&\"'!$B$7:$I$100\"),$AE91,AH$2),\"\")","v":""},{"$f":"IF($AE91<>\"\",INDEX(INDIRECT(\"'\"&$AD91&\"'!$B$7:$I$100\"),$AE91,AI$2),\"\")","v":""},{"$f":"IF($AE91<>\"\",INDEX(INDIRECT(\"'\"&$AD91&\"'!$B$7:$I$100\"),$AE91,AJ$2),\"\")","v":""},{"$f":"IF($AE91<>\"\",INDEX(INDIRECT(\"'\"&$AD91&\"'!$B$7:$I$100\"),$AE91,AK$2),\"\")","v":""},{"$f":"IF($AE91<>\"\",INDEX(INDIRECT(\"'\"&$AD91&\"'!$B$7:$I$100\"),$AE91,AL$2),\"\")","v":""},{"$f":"IF($AE91<>\"\",INDEX(INDIRECT(\"'\"&$AD91&\"'!$B$7:$I$100\"),$AE91,AM$2),\"\")","v":""},{"$f":"IF($AE91<>\"\",INDEX(INDIRECT(\"'\"&$AD91&\"'!$B$7:$I$100\"),$AE91,AN$2),\"\")","v":""},null,null,null,null,null,null,null,null,null,null,null,{"$f":"IFERROR( INDIRECT(\"'\"&$W91&\"'!$B$4\"), \"\")","v":""},"S89","",false,{"$error":"#VALUE!"},"S89",null,89,{"$f":"VLOOKUP(AC91,$Z$3:$AA129,2)","v":"S1"},""]
[null,"",{"$f":"IF($AE92<>\"\",INDEX(INDIRECT(\"'\"&$AD92&\"'!$B$7:$I$100\"),$AE92,AG$2),\"\")","v":""},{"$f":"IF($AE92<>\"\",INDEX(INDIRECT(\"'\"&$AD92&\"'!$B$7:$I$100\"),$AE92,AH$2),\"\")","v":""},{"$f":"IF($AE92<>\"\",INDEX(INDIRECT(\"'\"&$AD92&\"'!$B$7:$I$100\"),$AE92,AI$2),\"\")","v":""},{"$f":"IF($AE92<>\"\",INDEX(INDIRECT(\"'\"&$AD92&\"'!$B$7:$I$100\"),$AE92,AJ$2),\"\")","v":""},{"$f":"IF($AE92<>\"\",INDEX(INDIRECT(\"'\"&$AD92&\"'!$B$7:$I$100\"),$AE92,AK$2),\"\")","v":""},{"$f":"IF($AE92<>\"\",INDEX(INDIRECT(\"'\"&$AD92&\"'!$B$7:$I$100\"),$AE92,AL$2),\"\")","v":""},{"$f":"IF($AE92<>\"\",INDEX(INDIRECT(\"'\"&$AD92&\"'!$B$7:$I$100\"),$AE92,AM$2),\"\")","v":""},{"$f":"IF($AE92<>\"\",INDEX(INDIRECT(\"'\"&$AD92&\"'!$B$7:$I$100\"),$AE92,AN$2),\"\")","v":""},null,null,null,null,null,null,null,null,null,null,null,{"$f":"IFERROR( INDIRECT(\"'\"&$W92&\"'!$B$4\"), \"\")","v":""},"S90","",false,{"$error":"#VALUE!"},"S90",null,90,{"$f":"VLOOKUP(AC92,$Z$3:$AA130,2)","v":"S1"},""]
[null,"",{"$f":"IF($AE93<>\"\",INDEX(INDIRECT(\"'\"&$AD93&\"'!$B$7:$I$100\"),$AE93,AG$2),\"\")","v":""},{"$f":"IF($AE93<>\"\",INDEX(INDIRECT(\"'\"&$AD93&\"'!$B$7:$I$100\"),$AE93,AH$2),\"\")","v":""},{"$f":"IF($AE93<>\"\",INDEX(INDIRECT(\"'\"&$AD93&\"'!$B$7:$I$100\"),$AE93,AI$2),\"\")","v":""},{"$f":"IF($AE93<>\"\",INDEX(INDIRECT(\"'\"&$AD93&\"'!$B$7:$I$100\"),$AE93,AJ$2),\"\")","v":""},{"$f":"IF($AE93<>\"\",INDEX(INDIRECT(\"'\"&$AD93&\"'!$B$7:$I$100\"),$AE93,AK$2),\"\")","v":""},{"$f":"IF($AE93<>\"\",INDEX(INDIRECT(\"'\"&$AD93&\"'!$B$7:$I$100\"),$AE93,AL$2),\"\")","v":""},{"$f":"IF($AE93<>\"\",INDEX(INDIRECT(\"'\"&$AD93&\"'!$B$7:$I$100\"),$AE93,AM$2),\"\")","v":""},{"$f":"IF($AE93<>\"\",INDEX(INDIRECT(\"'\"&$AD93&\"'!$B$7:$I$100\"),$AE93,AN$2),\"\")","v":""},null,null,null,null,null,null,null,null,null,null,null,{"$f":"IFERROR( INDIRECT(\"'\"&$W93&\"'!$B$4\"), \"\")","v":""},"S91","",false,{"$error":"#VALUE!"},"S91",null,91,{"$f":"VLOOKUP(AC93,$Z$3:$AA131,2)","v":"S1"},""]
[null,"",{"$f":"IF($AE94<>\"\",INDEX(INDIRECT(\"'\"&$AD94&\"'!$B$7:$I$100\"),$AE94,AG$2),\"\")","v":""},{"$f":"IF($AE94<>\"\",INDEX(INDIRECT(\"'\"&$AD94&\"'!$B$7:$I$100\"),$AE94,AH$2),\"\")","v":""},{"$f":"IF($AE94<>\"\",INDEX(INDIRECT(\"'\"&$AD94&\"'!$B$7:$I$100\"),$AE94,AI$2),\"\")","v":""},{"$f":"IF($AE94<>\"\",INDEX(INDIRECT(\"'\"&$AD94&\"'!$B$7:$I$100\"),$AE94,AJ$2),\"\")","v":""},{"$f":"IF($AE94<>\"\",INDEX(INDIRECT(\"'\"&$AD94&\"'!$B$7:$I$100\"),$AE94,AK$2),\"\")","v":""},{"$f":"IF($AE94<>\"\",INDEX(INDIRECT(\"'\"&$AD94&\"'!$B$7:$I$100\"),$AE94,AL$2),\"\")","v":""},{"$f":"IF($AE94<>\"\",INDEX(INDIRECT(\"'\"&$AD94&\"'!$B$7:$I$100\"),$AE94,AM$2),\"\")","v":""},{"$f":"IF($AE94<>\"\",INDEX(INDIRECT(\"'\"&$AD94&\"'!$B$7:$I$100\"),$AE94,AN$2),\"\")","v":""},null,null,null,null,null,null,null,null,null,null,null,{"$f":"IFERROR( INDIRECT(\"'\"&$W94&\"'!$B$4\"), \"\")","v":""},"S92","",false,{"$error":"#VALUE!"},"S92",null,92,{"$f":"VLOOKUP(AC94,$Z$3:$AA132,2)","v":"S1"},""]
[null,"",{"$f":"IF($AE95<>\"\",INDEX(INDIRECT(\"'\"&$AD95&\"'!$B$7:$I$100\"),$AE95,AG$2),\"\")","v":""},{"$f":"IF($AE95<>\"\",INDEX(INDIRECT(\"'\"&$AD95&\"'!$B$7:$I$100\"),$AE95,AH$2),\"\")","v":""},{"$f":"IF($AE95<>\"\",INDEX(INDIRECT(\"'\"&$AD95&\"'!$B$7:$I$100\"),$AE95,AI$2),\"\")","v":""},{"$f":"IF($AE95<>\"\",INDEX(INDIRECT(\"'\"&$AD95&\"'!$B$7:$I$100\"),$AE95,AJ$2),\"\")","v":""},{"$f":"IF($AE95<>\"\",INDEX(INDIRECT(\"'\"&$AD95&\"'!$B$7:$I$100\"),$AE95,AK$2),\"\")","v":""},{"$f":"IF($AE95<>\"\",INDEX(INDIRECT(\"'\"&$AD95&\"'!$B$7:$I$100\"),$AE95,AL$2),\"\")","v":""},{"$f":"IF($AE95<>\"\",INDEX(INDIRECT(\"'\"&$AD95&\"'!$B$7:$I$100\"),$AE95,AM$2),\"\")","v":""},{"$f":"IF($AE95<>\"\",INDEX(INDIRECT(\"'\"&$AD95&\"'!$B$7:$I$100\"),$AE95,AN$2),\"\")","v":""},null,null,null,null,null,null,null,null,null,null,null,{"$f":"IFERROR( INDIRECT(\"'\"&$W95&\"'!$B$4\"), \"\")","v":""},"S93","",false,{"$error":"#VALUE!"},"S93",null,93,{"$f":"VLOOKUP(AC95,$Z$3:$AA133,2)","v":"S1"},""]
[null,"",{"$f":"IF($AE96<>\"\",INDEX(INDIRECT(\"'\"&$AD96&\"'!$B$7:$I$100\"),$AE96,AG$2),\"\")","v":""},{"$f":"IF($AE96<>\"\",INDEX(INDIRECT(\"'\"&$AD96&\"'!$B$7:$I$100\"),$AE96,AH$2),\"\")","v":""},{"$f":"IF($AE96<>\"\",INDEX(INDIRECT(\"'\"&$AD96&\"'!$B$7:$I$100\"),$AE96,AI$2),\"\")","v":""},{"$f":"IF($AE96<>\"\",INDEX(INDIRECT(\"'\"&$AD96&\"'!$B$7:$I$100\"),$AE96,AJ$2),\"\")","v":""},{"$f":"IF($AE96<>\"\",INDEX(INDIRECT(\"'\"&$AD96&\"'!$B$7:$I$100\"),$AE96,AK$2),\"\")","v":""},{"$f":"IF($AE96<>\"\",INDEX(INDIRECT(\"'\"&$AD96&\"'!$B$7:$I$100\"),$AE96,AL$2),\"\")","v":""},{"$f":"IF($AE96<>\"\",INDEX(INDIRECT(\"'\"&$AD96&\"'!$B$7:$I$100\"),$AE96,AM$2),\"\")","v":""},{"$f":"IF($AE96<>\"\",INDEX(INDIRECT(\"'\"&$AD96&\"'!$B$7:$I$100\"),$AE96,AN$2),\"\")","v":""},null,null,null,null,null,null,null,null,null,null,null,{"$f":"IFERROR( INDIRECT(\"'\"&$W96&\"'!$B$4\"), \"\")","v":""},"S94","",false,{"$error":"#VALUE!"},"S94",null,94,{"$f":"VLOOKUP(AC96,$Z$3:$AA134,2)","v":"S1"},""]
[null,"",{"$f":"IF($AE97<>\"\",INDEX(INDIRECT(\"'\"&$AD97&\"'!$B$7:$I$100\"),$AE97,AG$2),\"\")","v":""},{"$f":"IF($AE97<>\"\",INDEX(INDIRECT(\"'\"&$AD97&\"'!$B$7:$I$100\"),$AE97,AH$2),\"\")","v":""},{"$f":"IF($AE97<>\"\",INDEX(INDIRECT(\"'\"&$AD97&\"'!$B$7:$I$100\"),$AE97,AI$2),\"\")","v":""},{"$f":"IF($AE97<>\"\",INDEX(INDIRECT(\"'\"&$AD97&\"'!$B$7:$I$100\"),$AE97,AJ$2),\"\")","v":""},{"$f":"IF($AE97<>\"\",INDEX(INDIRECT(\"'\"&$AD97&\"'!$B$7:$I$100\"),$AE97,AK$2),\"\")","v":""},{"$f":"IF($AE97<>\"\",INDEX(INDIRECT(\"'\"&$AD97&\"'!$B$7:$I$100\"),$AE97,AL$2),\"\")","v":""},{"$f":"IF($AE97<>\"\",INDEX(INDIRECT(\"'\"&$AD97&\"'!$B$7:$I$100\"),$AE97,AM$2),\"\")","v":""},{"$f":"IF($AE97<>\"\",INDEX(INDIRECT(\"'\"&$AD97&\"'!$B$7:$I$100\"),$AE97,AN$2),\"\")","v":""},null,null,null,null,null,null,null,null,null,null,null,{"$f":"IFERROR( INDIRECT(\"'\"&$W97&\"'!$B$4\"), \"\")","v":""},"S95","",false,{"$error":"#VALUE!"},"S95",null,95,{"$f":"VLOOKUP(AC97,$Z$3:$AA135,2)","v":"S1"},""]
[null,"",{"$f":"IF($AE98<>\"\",INDEX(INDIRECT(\"'\"&$AD98&\"'!$B$7:$I$100\"),$AE98,AG$2),\"\")","v":""},{"$f":"IF($AE98<>\"\",INDEX(INDIRECT(\"'\"&$AD98&\"'!$B$7:$I$100\"),$AE98,AH$2),\"\")","v":""},{"$f":"IF($AE98<>\"\",INDEX(INDIRECT(\"'\"&$AD98&\"'!$B$7:$I$100\"),$AE98,AI$2),\"\")","v":""},{"$f":"IF($AE98<>\"\",INDEX(INDIRECT(\"'\"&$AD98&\"'!$B$7:$I$100\"),$AE98,AJ$2),\"\")","v":""},{"$f":"IF($AE98<>\"\",INDEX(INDIRECT(\"'\"&$AD98&\"'!$B$7:$I$100\"),$AE98,AK$2),\"\")","v":""},{"$f":"IF($AE98<>\"\",INDEX(INDIRECT(\"'\"&$AD98&\"'!$B$7:$I$100\"),$AE98,AL$2),\"\")","v":""},{"$f":"IF($AE98<>\"\",INDEX(INDIRECT(\"'\"&$AD98&\"'!$B$7:$I$100\"),$AE98,AM$2),\"\")","v":""},{"$f":"IF($AE98<>\"\",INDEX(INDIRECT(\"'\"&$AD98&\"'!$B$7:$I$100\"),$AE98,AN$2),\"\")","v":""},null,null,null,null,null,null,null,null,null,null,null,{"$f":"IFERROR( INDIRECT(\"'\"&$W98&\"'!$B$4\"), \"\")","v":""},"S96","",false,{"$error":"#VALUE!"},"S96",null,96,{"$f":"VLOOKUP(AC98,$Z$3:$AA136,2)","v":"S1"},""]
[null,"",{"$f":"IF($AE99<>\"\",INDEX(INDIRECT(\"'\"&$AD99&\"'!$B$7:$I$100\"),$AE99,AG$2),\"\")","v":""},{"$f":"IF($AE99<>\"\",INDEX(INDIRECT(\"'\"&$AD99&\"'!$B$7:$I$100\"),$AE99,AH$2),\"\")","v":""},{"$f":"IF($AE99<>\"\",INDEX(INDIRECT(\"'\"&$AD99&\"'!$B$7:$I$100\"),$AE99,AI$2),\"\")","v":""},{"$f":"IF($AE99<>\"\",INDEX(INDIRECT(\"'\"&$AD99&\"'!$B$7:$I$100\"),$AE99,AJ$2),\"\")","v":""},{"$f":"IF($AE99<>\"\",INDEX(INDIRECT(\"'\"&$AD99&\"'!$B$7:$I$100\"),$AE99,AK$2),\"\")","v":""},{"$f":"IF($AE99<>\"\",INDEX(INDIRECT(\"'\"&$AD99&\"'!$B$7:$I$100\"),$AE99,AL$2),\"\")","v":""},{"$f":"IF($AE99<>\"\",INDEX(INDIRECT(\"'\"&$AD99&\"'!$B$7:$I$100\"),$AE99,AM$2),\"\")","v":""},{"$f":"IF($AE99<>\"\",INDEX(INDIRECT(\"'\"&$AD99&\"'!$B$7:$I$100\"),$AE99,AN$2),\"\")","v":""},null,null,null,null,null,null,null,null,null,null,null,{"$f":"IFERROR( INDIRECT(\"'\"&$W99&\"'!$B$4\"), \"\")","v":""},"S97","",false,{"$error":"#VALUE!"},"S97",null,97,{"$f":"VLOOKUP(AC99,$Z$3:$AA137,2)","v":"S1"},""]
[null,"",{"$f":"IF($AE100<>\"\",INDEX(INDIRECT(\"'\"&$AD100&\"'!$B$7:$I$100\"),$AE100,AG$2),\"\")","v":""},{"$f":"IF($AE100<>\"\",INDEX(INDIRECT(\"'\"&$AD100&\"'!$B$7:$I$100\"),$AE100,AH$2),\"\")","v":""},{"$f":"IF($AE100<>\"\",INDEX(INDIRECT(\"'\"&$AD100&\"'!$B$7:$I$100\"),$AE100,AI$2),\"\")","v":""},{"$f":"IF($AE100<>\"\",INDEX(INDIRECT(\"'\"&$AD100&\"'!$B$7:$I$100\"),$AE100,AJ$2),\"\")","v":""},{"$f":"IF($AE100<>\"\",INDEX(INDIRECT(\"'\"&$AD100&\"'!$B$7:$I$100\"),$AE100,AK$2),\"\")","v":""},{"$f":"IF($AE100<>\"\",INDEX(INDIRECT(\"'\"&$AD100&\"'!$B$7:$I$100\"),$AE100,AL$2),\"\")","v":""},{"$f":"IF($AE100<>\"\",INDEX(INDIRECT(\"'\"&$AD100&\"'!$B$7:$I$100\"),$AE100,AM$2),\"\")","v":""},{"$f":"IF($AE100<>\"\",INDEX(INDIRECT(\"'\"&$AD100&\"'!$B$7:$I$100\"),$AE100,AN$2),\"\")","v":""},null,null,null,null,null,null,null,null,null,null,null,{"$f":"IFERROR( INDIRECT(\"'\"&$W100&\"'!$B$4\"), \"\")","v":""},"S98","",false,{"$error":"#VALUE!"},"S98",null,98,{"$f":"VLOOKUP(AC100,$Z$3:$AA138,2)","v":"S1"},""]
[null,"",{"$f":"IF($AE101<>\"\",INDEX(INDIRECT(\"'\"&$AD101&\"'!$B$7:$I$100\"),$AE101,AG$2),\"\")","v":""},{"$f":"IF($AE101<>\"\",INDEX(INDIRECT(\"'\"&$AD101&\"'!$B$7:$I$100\"),$AE101,AH$2),\"\")","v":""},{"$f":"IF($AE101<>\"\",INDEX(INDIRECT(\"'\"&$AD101&\"'!$B$7:$I$100\"),$AE101,AI$2),\"\")","v":""},{"$f":"IF($AE101<>\"\",INDEX(INDIRECT(\"'\"&$AD101&\"'!$B$7:$I$100\"),$AE101,AJ$2),\"\")","v":""},{"$f":"IF($AE101<>\"\",INDEX(INDIRECT(\"'\"&$AD101&\"'!$B$7:$I$100\"),$AE101,AK$2),\"\")","v":""},{"$f":"IF($AE101<>\"\",INDEX(INDIRECT(\"'\"&$AD101&\"'!$B$7:$I$100\"),$AE101,AL$2),\"\")","v":""},{"$f":"IF($AE101<>\"\",INDEX(INDIRECT(\"'\"&$AD101&\"'!$B$7:$I$100\"),$AE101,AM$2),\"\")","v":""},{"$f":"IF($AE101<>\"\",INDEX(INDIRECT(\"'\"&$AD101&\"'!$B$7:$I$100\"),$AE101,AN$2),\"\")","v":""},null,null,null,null,null,null,null,null,null,null,null,{"$f":"IFERROR( INDIRECT(\"'\"&$W101&\"'!$B$4\"), \"\")","v":""},"S99","",false,{"$error":"#VALUE!"},"S99",null,99,{"$f":"VLOOKUP(AC101,$Z$3:$AA139,2)","v":"S1"},""]
[null,"",{"$f":"IF($AE102<>\"\",INDEX(INDIRECT(\"'\"&$AD102&\"'!$B$7:$I$100\"),$AE102,AG$2),\"\")","v":""},{"$f":"IF($AE102<>\"\",INDEX(INDIRECT(\"'\"&$AD102&\"'!$B$7:$I$100\"),$AE102,AH$2),\"\")","v":""},{"$f":"IF($AE102<>\"\",INDEX(INDIRECT(\"'\"&$AD102&\"'!$B$7:$I$100\"),$AE102,AI$2),\"\")","v":""},{"$f":"IF($AE102<>\"\",INDEX(INDIRECT(\"'\"&$AD102&\"'!$B$7:$I$100\"),$AE102,AJ$2),\"\")","v":""},{"$f":"IF($AE102<>\"\",INDEX(INDIRECT(\"'\"&$AD102&\"'!$B$7:$I$100\"),$AE102,AK$2),\"\")","v":""},{"$f":"IF($AE102<>\"\",INDEX(INDIRECT(\"'\"&$AD102&\"'!$B$7:$I$100\"),$AE102,AL$2),\"\")","v":""},{"$f":"IF($AE102<>\"\",INDEX(INDIRECT(\"'\"&$AD102&\"'!$B$7:$I$100\"),$AE102,AM$2),\"\")","v":""},{"$f":"IF($AE102<>\"\",INDEX(INDIRECT(\"'\"&$AD102&\"'!$B$7:$I$100\"),$AE102,AN$2),\"\")","v":""},null,null,null,null,null,null,null,null,null,null,null,{"$f":"IFERROR( INDIRECT(\"'\"&$W102&\"'!$B$4\"), \"\")","v":""},"S100","",false,{"$error":"#VALUE!"},"S100",null,100,{"$f":"VLOOKUP(AC102,$Z$3:$AA140,2)","v":"S1"},""]
[null,"",{"$f":"IF($AE103<>\"\",INDEX(INDIRECT(\"'\"&$AD103&\"'!$B$7:$I$100\"),$AE103,AG$2),\"\")","v":""},{"$f":"IF($AE103<>\"\",INDEX(INDIRECT(\"'\"&$AD103&\"'!$B$7:$I$100\"),$AE103,AH$2),\"\")","v":""},{"$f":"IF($AE103<>\"\",INDEX(INDIRECT(\"'\"&$AD103&\"'!$B$7:$I$100\"),$AE103,AI$2),\"\")","v":""},{"$f":"IF($AE103<>\"\",INDEX(INDIRECT(\"'\"&$AD103&\"'!$B$7:$I$100\"),$AE103,AJ$2),\"\")","v":""},{"$f":"IF($AE103<>\"\",INDEX(INDIRECT(\"'\"&$AD103&\"'!$B$7:$I$100\"),$AE103,AK$2),\"\")","v":""},{"$f":"IF($AE103<>\"\",INDEX(INDIRECT(\"'\"&$AD103&\"'!$B$7:$I$100\"),$AE103,AL$2),\"\")","v":""},{"$f":"IF($AE103<>\"\",INDEX(INDIRECT(\"'\"&$AD103&\"'!$B$7:$I$100\"),$AE103,AM$2),\"\")","v":""},{"$f":"IF($AE103<>\"\",INDEX(INDIRECT(\"'\"&$AD103&\"'!$B$7:$I$100\"),$AE103,AN$2),\"\")","v":""},null,null,null,null,null,null,null,null,null,null,null,{"$f":"IFERROR( INDIRECT(\"'\"&$W103&\"'!$B$4\"), \"\")","v":""},"S101",{"$f":"V103","v":""},false,{"$f":"AB102+Z102","v":{"$error":"#VALUE!"}},"S101",null,101,{"$f":"VLOOKUP(AC103,$Z$3:$AA141,2)","v":"S1"},{"$f":"IF(VLOOKUP(AD103,$W$3:$AD$102,3,FALSE)=TRUE,IF(AD103=AD102,AE102+1,1),\"\")","v":""}]
[null,"",{"$f":"IF($AE104<>\"\",INDEX(INDIRECT(\"'\"&$AD104&\"'!$B$7:$I$100\"),$AE104,AG$2),\"\")","v":""},{"$f":"IF($AE104<>\"\",INDEX(INDIRECT(\"'\"&$AD104&\"'!$B$7:$I$100\"),$AE104,AH$2),\"\")","v":""},{"$f":"IF($AE104<>\"\",INDEX(INDIRECT(\"'\"&$AD104&\"'!$B$7:$I$100\"),$AE104,AI$2),\"\")","v":""},{"$f":"IF($AE104<>\"\",INDEX(INDIRECT(\"'\"&$AD104&\"'!$B$7:$I$100\"),$AE104,AJ$2),\"\")","v":""},{"$f":"IF($AE104<>\"\",INDEX(INDIRECT(\"'\"&$AD104&\"'!$B$7:$I$100\"),$AE104,AK$2),\"\")","v":""},{"$f":"IF($AE104<>\"\",INDEX(INDIRECT(\"'\"&$AD104&\"'!$B$7:$I$100\"),$AE104,AL$2),\"\")","v":""},{"$f":"IF($AE104<>\"\",INDEX(INDIRECT(\"'\"&$AD104&\"'!$B$7:$I$100\"),$AE104,AM$2),\"\")","v":""},{"$f":"IF($AE104<>\"\",INDEX(INDIRECT(\"'\"&$AD104&\"'!$B$7:$I$100\"),$AE104,AN$2),\"\")","v":""},null,null,null,null,null,null,null,null,null,null,null,{"$f":"IFERROR( INDIRECT(\"'\"&$W104&\"'!$B$4\"), \"\")","v":""},"S102","",false,{"$error":"#VALUE!"},"S102",null,102,{"$f":"VLOOKUP(AC104,$Z$3:$AA142,2)","v":"S1"},""]
[null,"",{"$f":"IF($AE105<>\"\",INDEX(INDIRECT(\"'\"&$AD105&\"'!$B$7:$I$100\"),$AE105,AG$2),\"\")","v":""},{"$f":"IF($AE105<>\"\",INDEX(INDIRECT(\"'\"&$AD105&\"'!$B$7:$I$100\"),$AE105,AH$2),\"\")","v":""},{"$f":"IF($AE105<>\"\",INDEX(INDIRECT(\"'\"&$AD105&\"'!$B$7:$I$100\"),$AE105,AI$2),\"\")","v":""},{"$f":"IF($AE105<>\"\",INDEX(INDIRECT(\"'\"&$AD105&\"'!$B$7:$I$100\"),$AE105,AJ$2),\"\")","v":""},{"$f":"IF($AE105<>\"\",INDEX(INDIRECT(\"'\"&$AD105&\"'!$B$7:$I$100\"),$AE105,AK$2),\"\")","v":""},{"$f":"IF($AE105<>\"\",INDEX(INDIRECT(\"'\"&$AD105&\"'!$B$7:$I$100\"),$AE105,AL$2),\"\")","v":""},{"$f":"IF($AE105<>\"\",INDEX(INDIRECT(\"'\"&$AD105&\"'!$B$7:$I$100\"),$AE105,AM$2),\"\")","v":""},{"$f":"IF($AE105<>\"\",INDEX(INDIRECT(\"'\"&$AD105&\"'!$B$7:$I$100\"),$AE105,AN$2),\"\")","v":""},null,null,null,null,null,null,null,null,null,null,null,{"$f":"IFERROR( INDIRECT(\"'\"&$W105&\"'!$B$4\"), \"\")","v":""},"S103","",false,{"$error":"#VALUE!"},"S103",null,103,{"$f":"VLOOKUP(AC105,$Z$3:$AA143,2)","v":"S1"},""]
[null,"",{"$f":"IF($AE106<>\"\",INDEX(INDIRECT(\"'\"&$AD106&\"'!$B$7:$I$100\"),$AE106,AG$2),\"\")","v":""},{"$f":"IF($AE106<>\"\",INDEX(INDIRECT(\"'\"&$AD106&\"'!$B$7:$I$100\"),$AE106,AH$2),\"\")","v":""},{"$f":"IF($AE106<>\"\",INDEX(INDIRECT(\"'\"&$AD106&\"'!$B$7:$I$100\"),$AE106,AI$2),\"\")","v":""},{"$f":"IF($AE106<>\"\",INDEX(INDIRECT(\"'\"&$AD106&\"'!$B$7:$I$100\"),$AE106,AJ$2),\"\")","v":""},{"$f":"IF($AE106<>\"\",INDEX(INDIRECT(\"'\"&$AD106&\"'!$B$7:$I$100\"),$AE106,AK$2),\"\")","v":""},{"$f":"IF($AE106<>\"\",INDEX(INDIRECT(\"'\"&$AD106&\"'!$B$7:$I$100\"),$AE106,AL$2),\"\")","v":""},{"$f":"IF($AE106<>\"\",INDEX(INDIRECT(\"'\"&$AD106&\"'!$B$7:$I$100\"),$AE106,AM$2),\"\")","v":""},{"$f":"IF($AE106<>\"\",INDEX(INDIRECT(\"'\"&$AD106&\"'!$B$7:$I$100\"),$AE106,AN$2),\"\")","v":""},null,null,null,null,null,null,null,null,null,null,null,{"$f":"IFERROR( INDIRECT(\"'\"&$W106&\"'!$B$4\"), \"\")","v":""},"S104","",false,{"$error":"#VALUE!"},"S104",null,104,{"$f":"VLOOKUP(AC106,$Z$3:$AA144,2)","v":"S1"},""]
[null,"",{"$f":"IF($AE107<>\"\",INDEX(INDIRECT(\"'\"&$AD107&\"'!$B$7:$I$100\"),$AE107,AG$2),\"\")","v":""},{"$f":"IF($AE107<>\"\",INDEX(INDIRECT(\"'\"&$AD107&\"'!$B$7:$I$100\"),$AE107,AH$2),\"\")","v":""},{"$f":"IF($AE107<>\"\",INDEX(INDIRECT(\"'\"&$AD107&\"'!$B$7:$I$100\"),$AE107,AI$2),\"\")","v":""},{"$f":"IF($AE107<>\"\",INDEX(INDIRECT(\"'\"&$AD107&\"'!$B$7:$I$100\"),$AE107,AJ$2),\"\")","v":""},{"$f":"IF($AE107<>\"\",INDEX(INDIRECT(\"'\"&$AD107&\"'!$B$7:$I$100\"),$AE107,AK$2),\"\")","v":""},{"$f":"IF($AE107<>\"\",INDEX(INDIRECT(\"'\"&$AD107&\"'!$B$7:$I$100\"),$AE107,AL$2),\"\")","v":""},{"$f":"IF($AE107<>\"\",INDEX(INDIRECT(\"'\"&$AD107&\"'!$B$7:$I$100\"),$AE107,AM$2),\"\")","v":""},{"$f":"IF($AE107<>\"\",INDEX(INDIRECT(\"'\"&$AD107&\"'!$B$7:$I$100\"),$AE107,AN$2),\"\")","v":""},null,null,null,null,null,null,null,null,null,null,null,{"$f":"IFERROR( INDIRECT(\"'\"&$W107&\"'!$B$4\"), \"\")","v":""},"S105","",false,{"$error":"#VALUE!"},"S105",null,105,{"$f":"VLOOKUP(AC107,$Z$3:$AA145,2)","v":"S1"},""]
[null,"",{"$f":"IF($AE108<>\"\",INDEX(INDIRECT(\"'\"&$AD108&\"'!$B$7:$I$100\"),$AE108,AG$2),\"\")","v":""},{"$f":"IF($AE108<>\"\",INDEX(INDIRECT(\"'\"&$AD108&\"'!$B$7:$I$100\"),$AE108,AH$2),\"\")","v":""},{"$f":"IF($AE108<>\"\",INDEX(INDIRECT(\"'\"&$AD108&\"'!$B$7:$I$100\"),$AE108,AI$2),\"\")","v":""},{"$f":"IF($AE108<>\"\",INDEX(INDIRECT(\"'\"&$AD108&\"'!$B$7:$I$100\"),$AE108,AJ$2),\"\")","v":""},{"$f":"IF($AE108<>\"\",INDEX(INDIRECT(\"'\"&$AD108&\"'!$B$7:$I$100\"),$AE108,AK$2),\"\")","v":""},{"$f":"IF($AE108<>\"\",INDEX(INDIRECT(\"'\"&$AD108&\"'!$B$7:$I$100\"),$AE108,AL$2),\"\")","v":""},{"$f":"IF($AE108<>\"\",INDEX(INDIRECT(\"'\"&$AD108&\"'!$B$7:$I$100\"),$AE108,AM$2),\"\")","v":""},{"$f":"IF($AE108<>\"\",INDEX(INDIRECT(\"'\"&$AD108&\"'!$B$7:$I$100\"),$AE108,AN$2),\"\")","v":""},null,null,null,null,null,null,null,null,null,null,null,{"$f":"IFERROR( INDIRECT(\"'\"&$W108&\"'!$B$4\"), \"\")","v":""},"S106","",false,{"$error":"#VALUE!"},"S106",null,106,{"$f":"VLOOKUP(AC108,$Z$3:$AA146,2)","v":"S1"},""]
[null,"",{"$f":"IF($AE109<>\"\",INDEX(INDIRECT(\"'\"&$AD109&\"'!$B$7:$I$100\"),$AE109,AG$2),\"\")","v":""},{"$f":"IF($AE109<>\"\",INDEX(INDIRECT(\"'\"&$AD109&\"'!$B$7:$I$100\"),$AE109,AH$2),\"\")","v":""},{"$f":"IF($AE109<>\"\",INDEX(INDIRECT(\"'\"&$AD109&\"'!$B$7:$I$100\"),$AE109,AI$2),\"\")","v":""},{"$f":"IF($AE109<>\"\",INDEX(INDIRECT(\"'\"&$AD109&\"'!$B$7:$I$100\"),$AE109,AJ$2),\"\")","v":""},{"$f":"IF($AE109<>\"\",INDEX(INDIRECT(\"'\"&$AD109&\"'!$B$7:$I$100\"),$AE109,AK$2),\"\")","v":""},{"$f":"IF($AE109<>\"\",INDEX(INDIRECT(\"'\"&$AD109&\"'!$B$7:$I$100\"),$AE109,AL$2),\"\")","v":""},{"$f":"IF($AE109<>\"\",INDEX(INDIRECT(\"'\"&$AD109&\"'!$B$7:$I$100\"),$AE109,AM$2),\"\")","v":""},{"$f":"IF($AE109<>\"\",INDEX(INDIRECT(\"'\"&$AD109&\"'!$B$7:$I$100\"),$AE109,AN$2),\"\")","v":""},null,null,null,null,null,null,null,null,null,null,null,{"$f":"IFERROR( INDIRECT(\"'\"&$W109&\"'!$B$4\"), \"\")","v":""},"S107","",false,{"$error":"#VALUE!"},"S107",null,107,{"$f":"VLOOKUP(AC109,$Z$3:$AA147,2)","v":"S1"},""]
[null,"",{"$f":"IF($AE110<>\"\",INDEX(INDIRECT(\"'\"&$AD110&\"'!$B$7:$I$100\"),$AE110,AG$2),\"\")","v":""},{"$f":"IF($AE110<>\"\",INDEX(INDIRECT(\"'\"&$AD110&\"'!$B$7:$I$100\"),$AE110,AH$2),\"\")","v":""},{"$f":"IF($AE110<>\"\",INDEX(INDIRECT(\"'\"&$AD110&\"'!$B$7:$I$100\"),$AE110,AI$2),\"\")","v":""},{"$f":"IF($AE110<>\"\",INDEX(INDIRECT(\"'\"&$AD110&\"'!$B$7:$I$100\"),$AE110,AJ$2),\"\")","v":""},{"$f":"IF($AE110<>\"\",INDEX(INDIRECT(\"'\"&$AD110&\"'!$B$7:$I$100\"),$AE110,AK$2),\"\")","v":""},{"$f":"IF($AE110<>\"\",INDEX(INDIRECT(\"'\"&$AD110&\"'!$B$7:$I$100\"),$AE110,AL$2),\"\")","v":""},{"$f":"IF($AE110<>\"\",INDEX(INDIRECT(\"'\"&$AD110&\"'!$B$7:$I$100\"),$AE110,AM$2),\"\")","v":""},{"$f":"IF($AE110<>\"\",INDEX(INDIRECT(\"'\"&$AD110&\"'!$B$7:$I$100\"),$AE110,AN$2),\"\")","v":""},null,null,null,null,null,null,null,null,null,null,null,{"$f":"IFERROR( INDIRECT(\"'\"&$W110&\"'!$B$4\"), \"\")","v":""},"S108","",false,{"$error":"#VALUE!"},"S108",null,108,{"$f":"VLOOKUP(AC110,$Z$3:$AA148,2)","v":"S1"},""]
[null,"",{"$f":"IF($AE111<>\"\",INDEX(INDIRECT(\"'\"&$AD111&\"'!$B$7:$I$100\"),$AE111,AG$2),\"\")","v":""},{"$f":"IF($AE111<>\"\",INDEX(INDIRECT(\"'\"&$AD111&\"'!$B$7:$I$100\"),$AE111,AH$2),\"\")","v":""},{"$f":"IF($AE111<>\"\",INDEX(INDIRECT(\"'\"&$AD111&\"'!$B$7:$I$100\"),$AE111,AI$2),\"\")","v":""},{"$f":"IF($AE111<>\"\",INDEX(INDIRECT(\"'\"&$AD111&\"'!$B$7:$I$100\"),$AE111,AJ$2),\"\")","v":""},{"$f":"IF($AE111<>\"\",INDEX(INDIRECT(\"'\"&$AD111&\"'!$B$7:$I$100\"),$AE111,AK$2),\"\")","v":""},{"$f":"IF($AE111<>\"\",INDEX(INDIRECT(\"'\"&$AD111&\"'!$B$7:$I$100\"),$AE111,AL$2),\"\")","v":""},{"$f":"IF($AE111<>\"\",INDEX(INDIRECT(\"'\"&$AD111&\"'!$B$7:$I$100\"),$AE111,AM$2),\"\")","v":""},{"$f":"IF($AE111<>\"\",INDEX(INDIRECT(\"'\"&$AD111&\"'!$B$7:$I$100\"),$AE111,AN$2),\"\")","v":""},null,null,null,null,null,null,null,null,null,null,null,{"$f":"IFERROR( INDIRECT(\"'\"&$W111&\"'!$B$4\"), \"\")","v":""},"S109","",false,{"$error":"#VALUE!"},"S109",null,109,{"$f":"VLOOKUP(AC111,$Z$3:$AA149,2)","v":"S1"},""]
[null,"",{"$f":"IF($AE112<>\"\",INDEX(INDIRECT(\"'\"&$AD112&\"'!$B$7:$I$100\"),$AE112,AG$2),\"\")","v":""},{"$f":"IF($AE112<>\"\",INDEX(INDIRECT(\"'\"&$AD112&\"'!$B$7:$I$100\"),$AE112,AH$2),\"\")","v":""},{"$f":"IF($AE112<>\"\",INDEX(INDIRECT(\"'\"&$AD112&\"'!$B$7:$I$100\"),$AE112,AI$2),\"\")","v":""},{"$f":"IF($AE112<>\"\",INDEX(INDIRECT(\"'\"&$AD112&\"'!$B$7:$I$100\"),$AE112,AJ$2),\"\")","v":""},{"$f":"IF($AE112<>\"\",INDEX(INDIRECT(\"'\"&$AD112&\"'!$B$7:$I$100\"),$AE112,AK$2),\"\")","v":""},{"$f":"IF($AE112<>\"\",INDEX(INDIRECT(\"'\"&$AD112&\"'!$B$7:$I$100\"),$AE112,AL$2),\"\")","v":""},{"$f":"IF($AE112<>\"\",INDEX(INDIRECT(\"'\"&$AD112&\"'!$B$7:$I$100\"),$AE112,AM$2),\"\")","v":""},{"$f":"IF($AE112<>\"\",INDEX(INDIRECT(\"'\"&$AD112&\"'!$B$7:$I$100\"),$AE112,AN$2),\"\")","v":""},null,null,null,null,null,null,null,null,null,null,null,{"$f":"IFERROR( INDIRECT(\"'\"&$W112&\"'!$B$4\"), \"\")","v":""},"S110","",false,{"$error":"#VALUE!"},"S110",null,110,{"$f":"VLOOKUP(AC112,$Z$3:$AA150,2)","v":"S1"},""]
[null,"",{"$f":"IF($AE113<>\"\",INDEX(INDIRECT(\"'\"&$AD113&\"'!$B$7:$I$100\"),$AE113,AG$2),\"\")","v":""},{"$f":"IF($AE113<>\"\",INDEX(INDIRECT(\"'\"&$AD113&\"'!$B$7:$I$100\"),$AE113,AH$2),\"\")","v":""},{"$f":"IF($AE113<>\"\",INDEX(INDIRECT(\"'\"&$AD113&\"'!$B$7:$I$100\"),$AE113,AI$2),\"\")","v":""},{"$f":"IF($AE113<>\"\",INDEX(INDIRECT(\"'\"&$AD113&\"'!$B$7:$I$100\"),$AE113,AJ$2),\"\")","v":""},{"$f":"IF($AE113<>\"\",INDEX(INDIRECT(\"'\"&$AD113&\"'!$B$7:$I$100\"),$AE113,AK$2),\"\")","v":""},{"$f":"IF($AE113<>\"\",INDEX(INDIRECT(\"'\"&$AD113&\"'!$B$7:$I$100\"),$AE113,AL$2),\"\")","v":""},{"$f":"IF($AE113<>\"\",INDEX(INDIRECT(\"'\"&$AD113&\"'!$B$7:$I$100\"),$AE113,AM$2),\"\")","v":""},{"$f":"IF($AE113<>\"\",INDEX(INDIRECT(\"'\"&$AD113&\"'!$B$7:$I$100\"),$AE113,AN$2),\"\")","v":""},null,null,null,null,null,null,null,null,null,null,null,{"$f":"IFERROR( INDIRECT(\"'\"&$W113&\"'!$B$4\"), \"\")","v":""},"S111","",false,{"$error":"#VALUE!"},"S111",null,111,{"$f":"VLOOKUP(AC113,$Z$3:$AA151,2)","v":"S1"},""]
[null,"",{"$f":"IF($AE114<>\"\",INDEX(INDIRECT(\"'\"&$AD114&\"'!$B$7:$I$100\"),$AE114,AG$2),\"\")","v":""},{"$f":"IF($AE114<>\"\",INDEX(INDIRECT(\"'\"&$AD114&\"'!$B$7:$I$100\"),$AE114,AH$2),\"\")","v":""},{"$f":"IF($AE114<>\"\",INDEX(INDIRECT(\"'\"&$AD114&\"'!$B$7:$I$100\"),$AE114,AI$2),\"\")","v":""},{"$f":"IF($AE114<>\"\",INDEX(INDIRECT(\"'\"&$AD114&\"'!$B$7:$I$100\"),$AE114,AJ$2),\"\")","v":""},{"$f":"IF($AE114<>\"\",INDEX(INDIRECT(\"'\"&$AD114&\"'!$B$7:$I$100\"),$AE114,AK$2),\"\")","v":""},{"$f":"IF($AE114<>\"\",INDEX(INDIRECT(\"'\"&$AD114&\"'!$B$7:$I$100\"),$AE114,AL$2),\"\")","v":""},{"$f":"IF($AE114<>\"\",INDEX(INDIRECT(\"'\"&$AD114&\"'!$B$7:$I$100\"),$AE114,AM$2),\"\")","v":""},{"$f":"IF($AE114<>\"\",INDEX(INDIRECT(\"'\"&$AD114&\"'!$B$7:$I$100\"),$AE114,AN$2),\"\")","v":""},null,null,null,null,null,null,null,null,null,null,null,{"$f":"IFERROR( INDIRECT(\"'\"&$W114&\"'!$B$4\"), \"\")","v":""},"S112","",false,{"$error":"#VALUE!"},"S112",null,112,{"$f":"VLOOKUP(AC114,$Z$3:$AA152,2)","v":"S1"},""]
[null,"",{"$f":"IF($AE115<>\"\",INDEX(INDIRECT(\"'\"&$AD115&\"'!$B$7:$I$100\"),$AE115,AG$2),\"\")","v":""},{"$f":"IF($AE115<>\"\",INDEX(INDIRECT(\"'\"&$AD115&\"'!$B$7:$I$100\"),$AE115,AH$2),\"\")","v":""},{"$f":"IF($AE115<>\"\",INDEX(INDIRECT(\"'\"&$AD115&\"'!$B$7:$I$100\"),$AE115,AI$2),\"\")","v":""},{"$f":"IF($AE115<>\"\",INDEX(INDIRECT(\"'\"&$AD115&\"'!$B$7:$I$100\"),$AE115,AJ$2),\"\")","v":""},{"$f":"IF($AE115<>\"\",INDEX(INDIRECT(\"'\"&$AD115&\"'!$B$7:$I$100\"),$AE115,AK$2),\"\")","v":""},{"$f":"IF($AE115<>\"\",INDEX(INDIRECT(\"'\"&$AD115&\"'!$B$7:$I$100\"),$AE115,AL$2),\"\")","v":""},{"$f":"IF($AE115<>\"\",INDEX(INDIRECT(\"'\"&$AD115&\"'!$B$7:$I$100\"),$AE115,AM$2),\"\")","v":""},{"$f":"IF($AE115<>\"\",INDEX(INDIRECT(\"'\"&$AD115&\"'!$B$7:$I$100\"),$AE115,AN$2),\"\")","v":""},null,null,null,null,null,null,null,null,null,null,null,{"$f":"IFERROR( INDIRECT(\"'\"&$W115&\"'!$B$4\"), \"\")","v":""},"S113","",false,{"$error":"#VALUE!"},"S113",null,113,{"$f":"VLOOKUP(AC115,$Z$3:$AA153,2)","v":"S1"},""]
[null,"",{"$f":"IF($AE116<>\"\",INDEX(INDIRECT(\"'\"&$AD116&\"'!$B$7:$I$100\"),$AE116,AG$2),\"\")","v":""},{"$f":"IF($AE116<>\"\",INDEX(INDIRECT(\"'\"&$AD116&\"'!$B$7:$I$100\"),$AE116,AH$2),\"\")","v":""},{"$f":"IF($AE116<>\"\",INDEX(INDIRECT(\"'\"&$AD116&\"'!$B$7:$I$100\"),$AE116,AI$2),\"\")","v":""},{"$f":"IF($AE116<>\"\",INDEX(INDIRECT(\"'\"&$AD116&\"'!$B$7:$I$100\"),$AE116,AJ$2),\"\")","v":""},{"$f":"IF($AE116<>\"\",INDEX(INDIRECT(\"'\"&$AD116&\"'!$B$7:$I$100\"),$AE116,AK$2),\"\")","v":""},{"$f":"IF($AE116<>\"\",INDEX(INDIRECT(\"'\"&$AD116&\"'!$B$7:$I$100\"),$AE116,AL$2),\"\")","v":""},{"$f":"IF($AE116<>\"\",INDEX(INDIRECT(\"'\"&$AD116&\"'!$B$7:$I$100\"),$AE116,AM$2),\"\")","v":""},{"$f":"IF($AE116<>\"\",INDEX(INDIRECT(\"'\"&$AD116&\"'!$B$7:$I$100\"),$AE116,AN$2),\"\")","v":""},null,null,null,null,null,null,null,null,null,null,null,{"$f":"IFERROR( INDIRECT(\"'\"&$W116&\"'!$B$4\"), \"\")","v":""},"S114","",false,{"$error":"#VALUE!"},"S114",null,114,{"$f":"VLOOKUP(AC116,$Z$3:$AA154,2)","v":"S1"},""]
[null,"",{"$f":"IF($AE117<>\"\",INDEX(INDIRECT(\"'\"&$AD117&\"'!$B$7:$I$100\"),$AE117,AG$2),\"\")","v":""},{"$f":"IF($AE117<>\"\",INDEX(INDIRECT(\"'\"&$AD117&\"'!$B$7:$I$100\"),$AE117,AH$2),\"\")","v":""},{"$f":"IF($AE117<>\"\",INDEX(INDIRECT(\"'\"&$AD117&\"'!$B$7:$I$100\"),$AE117,AI$2),\"\")","v":""},{"$f":"IF($AE117<>\"\",INDEX(INDIRECT(\"'\"&$AD117&\"'!$B$7:$I$100\"),$AE117,AJ$2),\"\")","v":""},{"$f":"IF($AE117<>\"\",INDEX(INDIRECT(\"'\"&$AD117&\"'!$B$7:$I$100\"),$AE117,AK$2),\"\")","v":""},{"$f":"IF($AE117<>\"\",INDEX(INDIRECT(\"'\"&$AD117&\"'!$B$7:$I$100\"),$AE117,AL$2),\"\")","v":""},{"$f":"IF($AE117<>\"\",INDEX(INDIRECT(\"'\"&$AD117&\"'!$B$7:$I$100\"),$AE117,AM$2),\"\")","v":""},{"$f":"IF($AE117<>\"\",INDEX(INDIRECT(\"'\"&$AD117&\"'!$B$7:$I$100\"),$AE117,AN$2),\"\")","v":""},null,null,null,null,null,null,null,null,null,null,null,{"$f":"IFERROR( INDIRECT(\"'\"&$W117&\"'!$B$4\"), \"\")","v":""},"S115","",false,{"$error":"#VALUE!"},"S115",null,115,{"$f":"VLOOKUP(AC117,$Z$3:$AA155,2)","v":"S1"},""]
[null,"",{"$f":"IF($AE118<>\"\",INDEX(INDIRECT(\"'\"&$AD118&\"'!$B$7:$I$100\"),$AE118,AG$2),\"\")","v":""},{"$f":"IF($AE118<>\"\",INDEX(INDIRECT(\"'\"&$AD118&\"'!$B$7:$I$100\"),$AE118,AH$2),\"\")","v":""},{"$f":"IF($AE118<>\"\",INDEX(INDIRECT(\"'\"&$AD118&\"'!$B$7:$I$100\"),$AE118,AI$2),\"\")","v":""},{"$f":"IF($AE118<>\"\",INDEX(INDIRECT(\"'\"&$AD118&\"'!$B$7:$I$100\"),$AE118,AJ$2),\"\")","v":""},{"$f":"IF($AE118<>\"\",INDEX(INDIRECT(\"'\"&$AD118&\"'!$B$7:$I$100\"),$AE118,AK$2),\"\")","v":""},{"$f":"IF($AE118<>\"\",INDEX(INDIRECT(\"'\"&$AD118&\"'!$B$7:$I$100\"),$AE118,AL$2),\"\")","v":""},{"$f":"IF($AE118<>\"\",INDEX(INDIRECT(\"'\"&$AD118&\"'!$B$7:$I$100\"),$AE118,AM$2),\"\")","v":""},{"$f":"IF($AE118<>\"\",INDEX(INDIRECT(\"'\"&$AD118&\"'!$B$7:$I$100\"),$AE118,AN$2),\"\")","v":""},null,null,null,null,null,null,null,null,null,null,null,{"$f":"IFERROR( INDIRECT(\"'\"&$W118&\"'!$B$4\"), \"\")","v":""},"S116","",false,{"$error":"#VALUE!"},"S116",null,116,{"$f":"VLOOKUP(AC118,$Z$3:$AA156,2)","v":"S1"},""]
[null,"",{"$f":"IF($AE119<>\"\",INDEX(INDIRECT(\"'\"&$AD119&\"'!$B$7:$I$100\"),$AE119,AG$2),\"\")","v":""},{"$f":"IF($AE119<>\"\",INDEX(INDIRECT(\"'\"&$AD119&\"'!$B$7:$I$100\"),$AE119,AH$2),\"\")","v":""},{"$f":"IF($AE119<>\"\",INDEX(INDIRECT(\"'\"&$AD119&\"'!$B$7:$I$100\"),$AE119,AI$2),\"\")","v":""},{"$f":"IF($AE119<>\"\",INDEX(INDIRECT(\"'\"&$AD119&\"'!$B$7:$I$100\"),$AE119,AJ$2),\"\")","v":""},{"$f":"IF($AE119<>\"\",INDEX(INDIRECT(\"'\"&$AD119&\"'!$B$7:$I$100\"),$AE119,AK$2),\"\")","v":""},{"$f":"IF($AE119<>\"\",INDEX(INDIRECT(\"'\"&$AD119&\"'!$B$7:$I$100\"),$AE119,AL$2),\"\")","v":""},{"$f":"IF($AE119<>\"\",INDEX(INDIRECT(\"'\"&$AD119&\"'!$B$7:$I$100\"),$AE119,AM$2),\"\")","v":""},{"$f":"IF($AE119<>\"\",INDEX(INDIRECT(\"'\"&$AD119&\"'!$B$7:$I$100\"),$AE119,AN$2),\"\")","v":""},null,null,null,null,null,null,null,null,null,null,null,{"$f":"IFERROR( INDIRECT(\"'\"&$W119&\"'!$B$4\"), \"\")","v":""},"S117","",false,{"$error":"#VALUE!"},"S117",null,117,{"$f":"VLOOKUP(AC119,$Z$3:$AA157,2)","v":"S1"},""]
[null,"",{"$f":"IF($AE120<>\"\",INDEX(INDIRECT(\"'\"&$AD120&\"'!$B$7:$I$100\"),$AE120,AG$2),\"\")","v":""},{"$f":"IF($AE120<>\"\",INDEX(INDIRECT(\"'\"&$AD120&\"'!$B$7:$I$100\"),$AE120,AH$2),\"\")","v":""},{"$f":"IF($AE120<>\"\",INDEX(INDIRECT(\"'\"&$AD120&\"'!$B$7:$I$100\"),$AE120,AI$2),\"\")","v":""},{"$f":"IF($AE120<>\"\",INDEX(INDIRECT(\"'\"&$AD120&\"'!$B$7:$I$100\"),$AE120,AJ$2),\"\")","v":""},{"$f":"IF($AE120<>\"\",INDEX(INDIRECT(\"'\"&$AD120&\"'!$B$7:$I$100\"),$AE120,AK$2),\"\")","v":""},{"$f":"IF($AE120<>\"\",INDEX(INDIRECT(\"'\"&$AD120&\"'!$B$7:$I$100\"),$AE120,AL$2),\"\")","v":""},{"$f":"IF($AE120<>\"\",INDEX(INDIRECT(\"'\"&$AD120&\"'!$B$7:$I$100\"),$AE120,AM$2),\"\")","v":""},{"$f":"IF($AE120<>\"\",INDEX(INDIRECT(\"'\"&$AD120&\"'!$B$7:$I$100\"),$AE120,AN$2),\"\")","v":""},null,null,null,null,null,null,null,null,null,null,null,{"$f":"IFERROR( INDIRECT(\"'\"&$W120&\"'!$B$4\"), \"\")","v":""},"S118","",false,{"$error":"#VALUE!"},"S118",null,118,{"$f":"VLOOKUP(AC120,$Z$3:$AA158,2)","v":"S1"},""]
[null,"",{"$f":"IF($AE121<>\"\",INDEX(INDIRECT(\"'\"&$AD121&\"'!$B$7:$I$100\"),$AE121,AG$2),\"\")","v":""},{"$f":"IF($AE121<>\"\",INDEX(INDIRECT(\"'\"&$AD121&\"'!$B$7:$I$100\"),$AE121,AH$2),\"\")","v":""},{"$f":"IF($AE121<>\"\",INDEX(INDIRECT(\"'\"&$AD121&\"'!$B$7:$I$100\"),$AE121,AI$2),\"\")","v":""},{"$f":"IF($AE121<>\"\",INDEX(INDIRECT(\"'\"&$AD121&\"'!$B$7:$I$100\"),$AE121,AJ$2),\"\")","v":""},{"$f":"IF($AE121<>\"\",INDEX(INDIRECT(\"'\"&$AD121&\"'!$B$7:$I$100\"),$AE121,AK$2),\"\")","v":""},{"$f":"IF($AE121<>\"\",INDEX(INDIRECT(\"'\"&$AD121&\"'!$B$7:$I$100\"),$AE121,AL$2),\"\")","v":""},{"$f":"IF($AE121<>\"\",INDEX(INDIRECT(\"'\"&$AD121&\"'!$B$7:$I$100\"),$AE121,AM$2),\"\")","v":""},{"$f":"IF($AE121<>\"\",INDEX(INDIRECT(\"'\"&$AD121&\"'!$B$7:$I$100\"),$AE121,AN$2),\"\")","v":""},null,null,null,null,null,null,null,null,null,null,null,{"$f":"IFERROR( INDIRECT(\"'\"&$W121&\"'!$B$4\"), \"\")","v":""},"S119","",false,{"$error":"#VALUE!"},"S119",null,119,{"$f":"VLOOKUP(AC121,$Z$3:$AA159,2)","v":"S1"},""]
[null,"",{"$f":"IF($AE122<>\"\",INDEX(INDIRECT(\"'\"&$AD122&\"'!$B$7:$I$100\"),$AE122,AG$2),\"\")","v":""},{"$f":"IF($AE122<>\"\",INDEX(INDIRECT(\"'\"&$AD122&\"'!$B$7:$I$100\"),$AE122,AH$2),\"\")","v":""},{"$f":"IF($AE122<>\"\",INDEX(INDIRECT(\"'\"&$AD122&\"'!$B$7:$I$100\"),$AE122,AI$2),\"\")","v":""},{"$f":"IF($AE122<>\"\",INDEX(INDIRECT(\"'\"&$AD122&\"'!$B$7:$I$100\"),$AE122,AJ$2),\"\")","v":""},{"$f":"IF($AE122<>\"\",INDEX(INDIRECT(\"'\"&$AD122&\"'!$B$7:$I$100\"),$AE122,AK$2),\"\")","v":""},{"$f":"IF($AE122<>\"\",INDEX(INDIRECT(\"'\"&$AD122&\"'!$B$7:$I$100\"),$AE122,AL$2),\"\")","v":""},{"$f":"IF($AE122<>\"\",INDEX(INDIRECT(\"'\"&$AD122&\"'!$B$7:$I$100\"),$AE122,AM$2),\"\")","v":""},{"$f":"IF($AE122<>\"\",INDEX(INDIRECT(\"'\"&$AD122&\"'!$B$7:$I$100\"),$AE122,AN$2),\"\")","v":""},null,null,null,null,null,null,null,null,null,null,null,{"$f":"IFERROR( INDIRECT(\"'\"&$W122&\"'!$B$4\"), \"\")","v":""},"S120","",false,{"$error":"#VALUE!"},"S120",null,120,{"$f":"VLOOKUP(AC122,$Z$3:$AA160,2)","v":"S1"},""]
[null,"",{"$f":"IF($AE123<>\"\",INDEX(INDIRECT(\"'\"&$AD123&\"'!$B$7:$I$100\"),$AE123,AG$2),\"\")","v":""},{"$f":"IF($AE123<>\"\",INDEX(INDIRECT(\"'\"&$AD123&\"'!$B$7:$I$100\"),$AE123,AH$2),\"\")","v":""},{"$f":"IF($AE123<>\"\",INDEX(INDIRECT(\"'\"&$AD123&\"'!$B$7:$I$100\"),$AE123,AI$2),\"\")","v":""},{"$f":"IF($AE123<>\"\",INDEX(INDIRECT(\"'\"&$AD123&\"'!$B$7:$I$100\"),$AE123,AJ$2),\"\")","v":""},{"$f":"IF($AE123<>\"\",INDEX(INDIRECT(\"'\"&$AD123&\"'!$B$7:$I$100\"),$AE123,AK$2),\"\")","v":""},{"$f":"IF($AE123<>\"\",INDEX(INDIRECT(\"'\"&$AD123&\"'!$B$7:$I$100\"),$AE123,AL$2),\"\")","v":""},{"$f":"IF($AE123<>\"\",INDEX(INDIRECT(\"'\"&$AD123&\"'!$B$7:$I$100\"),$AE123,AM$2),\"\")","v":""},{"$f":"IF($AE123<>\"\",INDEX(INDIRECT(\"'\"&$AD123&\"'!$B$7:$I$100\"),$AE123,AN$2),\"\")","v":""},null,null,null,null,null,null,null,null,null,null,null,{"$f":"IFERROR( INDIRECT(\"'\"&$W123&\"'!$B$4\"), \"\")","v":""},"S121","",false,{"$error":"#VALUE!"},"S121",null,121,{"$f":"VLOOKUP(AC123,$Z$3:$AA161,2)","v":"S1"},""]
[null,"",{"$f":"IF($AE124<>\"\",INDEX(INDIRECT(\"'\"&$AD124&\"'!$B$7:$I$100\"),$AE124,AG$2),\"\")","v":""},{"$f":"IF($AE124<>\"\",INDEX(INDIRECT(\"'\"&$AD124&\"'!$B$7:$I$100\"),$AE124,AH$2),\"\")","v":""},{"$f":"IF($AE124<>\"\",INDEX(INDIRECT(\"'\"&$AD124&\"'!$B$7:$I$100\"),$AE124,AI$2),\"\")","v":""},{"$f":"IF($AE124<>\"\",INDEX(INDIRECT(\"'\"&$AD124&\"'!$B$7:$I$100\"),$AE124,AJ$2),\"\")","v":""},{"$f":"IF($AE124<>\"\",INDEX(INDIRECT(\"'\"&$AD124&\"'!$B$7:$I$100\"),$AE124,AK$2),\"\")","v":""},{"$f":"IF($AE124<>\"\",INDEX(INDIRECT(\"'\"&$AD124&\"'!$B$7:$I$100\"),$AE124,AL$2),\"\")","v":""},{"$f":"IF($AE124<>\"\",INDEX(INDIRECT(\"'\"&$AD124&\"'!$B$7:$I$100\"),$AE124,AM$2),\"\")","v":""},{"$f":"IF($AE124<>\"\",INDEX(INDIRECT(\"'\"&$AD124&\"'!$B$7:$I$100\"),$AE124,AN$2),\"\")","v":""},null,null,null,null,null,null,null,null,null,null,null,{"$f":"IFERROR( INDIRECT(\"'\"&$W124&\"'!$B$4\"), \"\")","v":""},"S122","",false,{"$error":"#VALUE!"},"S122",null,122,{"$f":"VLOOKUP(AC124,$Z$3:$AA162,2)","v":"S1"},""]
[null,{"$f":"IF($AE125<>\"\",VLOOKUP(AD125,$W$3:$X$42,2,FALSE),\"\")","v":""},{"$f":"IF($AE125<>\"\",INDEX(INDIRECT(\"'\"&$AD125&\"'!$B$7:$I$100\"),$AE125,AG$2),\"\")","v":""},{"$f":"IF($AE125<>\"\",INDEX(INDIRECT(\"'\"&$AD125&\"'!$B$7:$I$100\"),$AE125,AH$2),\"\")","v":""},{"$f":"IF($AE125<>\"\",INDEX(INDIRECT(\"'\"&$AD125&\"'!$B$7:$I$100\"),$AE125,AI$2),\"\")","v":""},{"$f":"IF($AE125<>\"\",INDEX(INDIRECT(\"'\"&$AD125&\"'!$B$7:$I$100\"),$AE125,AJ$2),\"\")","v":""},{"$f":"IF($AE125<>\"\",INDEX(INDIRECT(\"'\"&$AD125&\"'!$B$7:$I$100\"),$AE125,AK$2),\"\")","v":""},{"$f":"IF($AE125<>\"\",INDEX(INDIRECT(\"'\"&$AD125&\"'!$B$7:$I$100\"),$AE125,AL$2),\"\")","v":""},{"$f":"IF($AE125<>\"\",INDEX(INDIRECT(\"'\"&$AD125&\"'!$B$7:$I$100\"),$AE125,AM$2),\"\")","v":""},{"$f":"IF($AE125<>\"\",INDEX(INDIRECT(\"'\"&$AD125&\"'!$B$7:$I$100\"),$AE125,AN$2),\"\")","v":""},null,null,null,null,null,null,null,null,null,null,null,{"$f":"IFERROR( INDIRECT(\"'\"&$W125&\"'!$B$4\"), \"\")","v":""},"S123","",false,{"$error":"#VALUE!"},"S123",null,123,{"$f":"VLOOKUP(AC125,$Z$3:$AA163,2)","v":"S1"},""]
[null,"",{"$f":"IF($AE126<>\"\",INDEX(INDIRECT(\"'\"&$AD126&\"'!$B$7:$I$100\"),$AE126,AG$2),\"\")","v":""},{"$f":"IF($AE126<>\"\",INDEX(INDIRECT(\"'\"&$AD126&\"'!$B$7:$I$100\"),$AE126,AH$2),\"\")","v":""},{"$f":"IF($AE126<>\"\",INDEX(INDIRECT(\"'\"&$AD126&\"'!$B$7:$I$100\"),$AE126,AI$2),\"\")","v":""},{"$f":"IF($AE126<>\"\",INDEX(INDIRECT(\"'\"&$AD126&\"'!$B$7:$I$100\"),$AE126,AJ$2),\"\")","v":""},{"$f":"IF($AE126<>\"\",INDEX(INDIRECT(\"'\"&$AD126&\"'!$B$7:$I$100\"),$AE126,AK$2),\"\")","v":""},{"$f":"IF($AE126<>\"\",INDEX(INDIRECT(\"'\"&$AD126&\"'!$B$7:$I$100\"),$AE126,AL$2),\"\")","v":""},{"$f":"IF($AE126<>\"\",INDEX(INDIRECT(\"'\"&$AD126&\"'!$B$7:$I$100\"),$AE126,AM$2),\"\")","v":""},{"$f":"IF($AE126<>\"\",INDEX(INDIRECT(\"'\"&$AD126&\"'!$B$7:$I$100\"),$AE126,AN$2),\"\")","v":""},null,null,null,null,null,null,null,null,null,null,null,{"$f":"IFERROR( INDIRECT(\"'\"&$W126&\"'!$B$4\"), \"\")","v":""},"S124","",false,{"$error":"#VALUE!"},"S124",null,124,{"$f":"VLOOKUP(AC126,$Z$3:$AA164,2)","v":"S1"},""]
[null,"",{"$f":"IF($AE127<>\"\",INDEX(INDIRECT(\"'\"&$AD127&\"'!$B$7:$I$100\"),$AE127,AG$2),\"\")","v":""},{"$f":"IF($AE127<>\"\",INDEX(INDIRECT(\"'\"&$AD127&\"'!$B$7:$I$100\"),$AE127,AH$2),\"\")","v":""},{"$f":"IF($AE127<>\"\",INDEX(INDIRECT(\"'\"&$AD127&\"'!$B$7:$I$100\"),$AE127,AI$2),\"\")","v":""},{"$f":"IF($AE127<>\"\",INDEX(INDIRECT(\"'\"&$AD127&\"'!$B$7:$I$100\"),$AE127,AJ$2),\"\")","v":""},{"$f":"IF($AE127<>\"\",INDEX(INDIRECT(\"'\"&$AD127&\"'!$B$7:$I$100\"),$AE127,AK$2),\"\")","v":""},{"$f":"IF($AE127<>\"\",INDEX(INDIRECT(\"'\"&$AD127&\"'!$B$7:$I$100\"),$AE127,AL$2),\"\")","v":""},{"$f":"IF($AE127<>\"\",INDEX(INDIRECT(\"'\"&$AD127&\"'!$B$7:$I$100\"),$AE127,AM$2),\"\")","v":""},{"$f":"IF($AE127<>\"\",INDEX(INDIRECT(\"'\"&$AD127&\"'!$B$7:$I$100\"),$AE127,AN$2),\"\")","v":""},null,null,null,null,null,null,null,null,null,null,null,{"$f":"IFERROR( INDIRECT(\"'\"&$W127&\"'!$B$4\"), \"\")","v":""},"S125","",false,{"$error":"#VALUE!"},"S125",null,125,{"$f":"VLOOKUP(AC127,$Z$3:$AA165,2)","v":"S1"},""]
[null,"",{"$f":"IF($AE128<>\"\",INDEX(INDIRECT(\"'\"&$AD128&\"'!$B$7:$I$100\"),$AE128,AG$2),\"\")","v":""},{"$f":"IF($AE128<>\"\",INDEX(INDIRECT(\"'\"&$AD128&\"'!$B$7:$I$100\"),$AE128,AH$2),\"\")","v":""},{"$f":"IF($AE128<>\"\",INDEX(INDIRECT(\"'\"&$AD128&\"'!$B$7:$I$100\"),$AE128,AI$2),\"\")","v":""},{"$f":"IF($AE128<>\"\",INDEX(INDIRECT(\"'\"&$AD128&\"'!$B$7:$I$100\"),$AE128,AJ$2),\"\")","v":""},{"$f":"IF($AE128<>\"\",INDEX(INDIRECT(\"'\"&$AD128&\"'!$B$7:$I$100\"),$AE128,AK$2),\"\")","v":""},{"$f":"IF($AE128<>\"\",INDEX(INDIRECT(\"'\"&$AD128&\"'!$B$7:$I$100\"),$AE128,AL$2),\"\")","v":""},{"$f":"IF($AE128<>\"\",INDEX(INDIRECT(\"'\"&$AD128&\"'!$B$7:$I$100\"),$AE128,AM$2),\"\")","v":""},{"$f":"IF($AE128<>\"\",INDEX(INDIRECT(\"'\"&$AD128&\"'!$B$7:$I$100\"),$AE128,AN$2),\"\")","v":""},null,null,null,null,null,null,null,null,null,null,null,{"$f":"IFERROR( INDIRECT(\"'\"&$W128&\"'!$B$4\"), \"\")","v":""},"S126","",false,{"$error":"#VALUE!"},"S126",null,126,{"$f":"VLOOKUP(AC128,$Z$3:$AA166,2)","v":"S1"},""]
[null,"",{"$f":"IF($AE129<>\"\",INDEX(INDIRECT(\"'\"&$AD129&\"'!$B$7:$I$100\"),$AE129,AG$2),\"\")","v":""},{"$f":"IF($AE129<>\"\",INDEX(INDIRECT(\"'\"&$AD129&\"'!$B$7:$I$100\"),$AE129,AH$2),\"\")","v":""},{"$f":"IF($AE129<>\"\",INDEX(INDIRECT(\"'\"&$AD129&\"'!$B$7:$I$100\"),$AE129,AI$2),\"\")","v":""},{"$f":"IF($AE129<>\"\",INDEX(INDIRECT(\"'\"&$AD129&\"'!$B$7:$I$100\"),$AE129,AJ$2),\"\")","v":""},{"$f":"IF($AE129<>\"\",INDEX(INDIRECT(\"'\"&$AD129&\"'!$B$7:$I$100\"),$AE129,AK$2),\"\")","v":""},{"$f":"IF($AE129<>\"\",INDEX(INDIRECT(\"'\"&$AD129&\"'!$B$7:$I$100\"),$AE129,AL$2),\"\")","v":""},{"$f":"IF($AE129<>\"\",INDEX(INDIRECT(\"'\"&$AD129&\"'!$B$7:$I$100\"),$AE129,AM$2),\"\")","v":""},{"$f":"IF($AE129<>\"\",INDEX(INDIRECT(\"'\"&$AD129&\"'!$B$7:$I$100\"),$AE129,AN$2),\"\")","v":""},null,null,null,null,null,null,null,null,null,null,null,{"$f":"IFERROR( INDIRECT(\"'\"&$W129&\"'!$B$4\"), \"\")","v":""},"S127","",false,{"$error":"#VALUE!"},"S127",null,127,{"$f":"VLOOKUP(AC129,$Z$3:$AA167,2)","v":"S1"},""]
[null,"",{"$f":"IF($AE130<>\"\",INDEX(INDIRECT(\"'\"&$AD130&\"'!$B$7:$I$100\"),$AE130,AG$2),\"\")","v":""},{"$f":"IF($AE130<>\"\",INDEX(INDIRECT(\"'\"&$AD130&\"'!$B$7:$I$100\"),$AE130,AH$2),\"\")","v":""},{"$f":"IF($AE130<>\"\",INDEX(INDIRECT(\"'\"&$AD130&\"'!$B$7:$I$100\"),$AE130,AI$2),\"\")","v":""},{"$f":"IF($AE130<>\"\",INDEX(INDIRECT(\"'\"&$AD130&\"'!$B$7:$I$100\"),$AE130,AJ$2),\"\")","v":""},{"$f":"IF($AE130<>\"\",INDEX(INDIRECT(\"'\"&$AD130&\"'!$B$7:$I$100\"),$AE130,AK$2),\"\")","v":""},{"$f":"IF($AE130<>\"\",INDEX(INDIRECT(\"'\"&$AD130&\"'!$B$7:$I$100\"),$AE130,AL$2),\"\")","v":""},{"$f":"IF($AE130<>\"\",INDEX(INDIRECT(\"'\"&$AD130&\"'!$B$7:$I$100\"),$AE130,AM$2),\"\")","v":""},{"$f":"IF($AE130<>\"\",INDEX(INDIRECT(\"'\"&$AD130&\"'!$B$7:$I$100\"),$AE130,AN$2),\"\")","v":""},null,null,null,null,null,null,null,null,null,null,null,{"$f":"IFERROR( INDIRECT(\"'\"&$W130&\"'!$B$4\"), \"\")","v":""},"S128","",false,{"$error":"#VALUE!"},"S128",null,128,{"$f":"VLOOKUP(AC130,$Z$3:$AA168,2)","v":"S1"},""]
[null,"",{"$f":"IF($AE131<>\"\",INDEX(INDIRECT(\"'\"&$AD131&\"'!$B$7:$I$100\"),$AE131,AG$2),\"\")","v":""},{"$f":"IF($AE131<>\"\",INDEX(INDIRECT(\"'\"&$AD131&\"'!$B$7:$I$100\"),$AE131,AH$2),\"\")","v":""},{"$f":"IF($AE131<>\"\",INDEX(INDIRECT(\"'\"&$AD131&\"'!$B$7:$I$100\"),$AE131,AI$2),\"\")","v":""},{"$f":"IF($AE131<>\"\",INDEX(INDIRECT(\"'\"&$AD131&\"'!$B$7:$I$100\"),$AE131,AJ$2),\"\")","v":""},{"$f":"IF($AE131<>\"\",INDEX(INDIRECT(\"'\"&$AD131&\"'!$B$7:$I$100\"),$AE131,AK$2),\"\")","v":""},{"$f":"IF($AE131<>\"\",INDEX(INDIRECT(\"'\"&$AD131&\"'!$B$7:$I$100\"),$AE131,AL$2),\"\")","v":""},{"$f":"IF($AE131<>\"\",INDEX(INDIRECT(\"'\"&$AD131&\"'!$B$7:$I$100\"),$AE131,AM$2),\"\")","v":""},{"$f":"IF($AE131<>\"\",INDEX(INDIRECT(\"'\"&$AD131&\"'!$B$7:$I$100\"),$AE131,AN$2),\"\")","v":""},null,null,null,null,null,null,null,null,null,null,null,{"$f":"IFERROR( INDIRECT(\"'\"&$W131&\"'!$B$4\"), \"\")","v":""},"S129","",false,{"$error":"#VALUE!"},"S129",null,129,{"$f":"VLOOKUP(AC131,$Z$3:$AA169,2)","v":"S1"},""]
[null,"",{"$f":"IF($AE132<>\"\",INDEX(INDIRECT(\"'\"&$AD132&\"'!$B$7:$I$100\"),$AE132,AG$2),\"\")","v":""},{"$f":"IF($AE132<>\"\",INDEX(INDIRECT(\"'\"&$AD132&\"'!$B$7:$I$100\"),$AE132,AH$2),\"\")","v":""},{"$f":"IF($AE132<>\"\",INDEX(INDIRECT(\"'\"&$AD132&\"'!$B$7:$I$100\"),$AE132,AI$2),\"\")","v":""},{"$f":"IF($AE132<>\"\",INDEX(INDIRECT(\"'\"&$AD132&\"'!$B$7:$I$100\"),$AE132,AJ$2),\"\")","v":""},{"$f":"IF($AE132<>\"\",INDEX(INDIRECT(\"'\"&$AD132&\"'!$B$7:$I$100\"),$AE132,AK$2),\"\")","v":""},{"$f":"IF($AE132<>\"\",INDEX(INDIRECT(\"'\"&$AD132&\"'!$B$7:$I$100\"),$AE132,AL$2),\"\")","v":""},{"$f":"IF($AE132<>\"\",INDEX(INDIRECT(\"'\"&$AD132&\"'!$B$7:$I$100\"),$AE132,AM$2),\"\")","v":""},{"$f":"IF($AE132<>\"\",INDEX(INDIRECT(\"'\"&$AD132&\"'!$B$7:$I$100\"),$AE132,AN$2),\"\")","v":""},null,null,null,null,null,null,null,null,null,null,null,{"$f":"IFERROR( INDIRECT(\"'\"&$W132&\"'!$B$4\"), \"\")","v":""},"S130","",false,{"$error":"#VALUE!"},"S130",null,130,{"$f":"VLOOKUP(AC132,$Z$3:$AA170,2)","v":"S1"},""]
[null,"",{"$f":"IF($AE133<>\"\",INDEX(INDIRECT(\"'\"&$AD133&\"'!$B$7:$I$100\"),$AE133,AG$2),\"\")","v":""},{"$f":"IF($AE133<>\"\",INDEX(INDIRECT(\"'\"&$AD133&\"'!$B$7:$I$100\"),$AE133,AH$2),\"\")","v":""},{"$f":"IF($AE133<>\"\",INDEX(INDIRECT(\"'\"&$AD133&\"'!$B$7:$I$100\"),$AE133,AI$2),\"\")","v":""},{"$f":"IF($AE133<>\"\",INDEX(INDIRECT(\"'\"&$AD133&\"'!$B$7:$I$100\"),$AE133,AJ$2),\"\")","v":""},{"$f":"IF($AE133<>\"\",INDEX(INDIRECT(\"'\"&$AD133&\"'!$B$7:$I$100\"),$AE133,AK$2),\"\")","v":""},{"$f":"IF($AE133<>\"\",INDEX(INDIRECT(\"'\"&$AD133&\"'!$B$7:$I$100\"),$AE133,AL$2),\"\")","v":""},{"$f":"IF($AE133<>\"\",INDEX(INDIRECT(\"'\"&$AD133&\"'!$B$7:$I$100\"),$AE133,AM$2),\"\")","v":""},{"$f":"IF($AE133<>\"\",INDEX(INDIRECT(\"'\"&$AD133&\"'!$B$7:$I$100\"),$AE133,AN$2),\"\")","v":""},null,null,null,null,null,null,null,null,null,null,null,{"$f":"IFERROR( INDIRECT(\"'\"&$W133&\"'!$B$4\"), \"\")","v":""},"S131","",false,{"$error":"#VALUE!"},"S131",null,131,{"$f":"VLOOKUP(AC133,$Z$3:$AA171,2)","v":"S1"},""]
[null,"",{"$f":"IF($AE134<>\"\",INDEX(INDIRECT(\"'\"&$AD134&\"'!$B$7:$I$100\"),$AE134,AG$2),\"\")","v":""},{"$f":"IF($AE134<>\"\",INDEX(INDIRECT(\"'\"&$AD134&\"'!$B$7:$I$100\"),$AE134,AH$2),\"\")","v":""},{"$f":"IF($AE134<>\"\",INDEX(INDIRECT(\"'\"&$AD134&\"'!$B$7:$I$100\"),$AE134,AI$2),\"\")","v":""},{"$f":"IF($AE134<>\"\",INDEX(INDIRECT(\"'\"&$AD134&\"'!$B$7:$I$100\"),$AE134,AJ$2),\"\")","v":""},{"$f":"IF($AE134<>\"\",INDEX(INDIRECT(\"'\"&$AD134&\"'!$B$7:$I$100\"),$AE134,AK$2),\"\")","v":""},{"$f":"IF($AE134<>\"\",INDEX(INDIRECT(\"'\"&$AD134&\"'!$B$7:$I$100\"),$AE134,AL$2),\"\")","v":""},{"$f":"IF($AE134<>\"\",INDEX(INDIRECT(\"'\"&$AD134&\"'!$B$7:$I$100\"),$AE134,AM$2),\"\")","v":""},{"$f":"IF($AE134<>\"\",INDEX(INDIRECT(\"'\"&$AD134&\"'!$B$7:$I$100\"),$AE134,AN$2),\"\")","v":""},null,null,null,null,null,null,null,null,null,null,null,{"$f":"IFERROR( INDIRECT(\"'\"&$W134&\"'!$B$4\"), \"\")","v":""},"S132","",false,{"$error":"#VALUE!"},"S132",null,132,{"$f":"VLOOKUP(AC134,$Z$3:$AA172,2)","v":"S1"},""]
[null,"",{"$f":"IF($AE135<>\"\",INDEX(INDIRECT(\"'\"&$AD135&\"'!$B$7:$I$100\"),$AE135,AG$2),\"\")","v":""},{"$f":"IF($AE135<>\"\",INDEX(INDIRECT(\"'\"&$AD135&\"'!$B$7:$I$100\"),$AE135,AH$2),\"\")","v":""},{"$f":"IF($AE135<>\"\",INDEX(INDIRECT(\"'\"&$AD135&\"'!$B$7:$I$100\"),$AE135,AI$2),\"\")","v":""},{"$f":"IF($AE135<>\"\",INDEX(INDIRECT(\"'\"&$AD135&\"'!$B$7:$I$100\"),$AE135,AJ$2),\"\")","v":""},{"$f":"IF($AE135<>\"\",INDEX(INDIRECT(\"'\"&$AD135&\"'!$B$7:$I$100\"),$AE135,AK$2),\"\")","v":""},{"$f":"IF($AE135<>\"\",INDEX(INDIRECT(\"'\"&$AD135&\"'!$B$7:$I$100\"),$AE135,AL$2),\"\")","v":""},{"$f":"IF($AE135<>\"\",INDEX(INDIRECT(\"'\"&$AD135&\"'!$B$7:$I$100\"),$AE135,AM$2),\"\")","v":""},{"$f":"IF($AE135<>\"\",INDEX(INDIRECT(\"'\"&$AD135&\"'!$B$7:$I$100\"),$AE135,AN$2),\"\")","v":""},null,null,null,null,null,null,null,null,null,null,null,{"$f":"IFERROR( INDIRECT(\"'\"&$W135&\"'!$B$4\"), \"\")","v":""},"S133","",false,{"$error":"#VALUE!"},"S133",null,133,{"$f":"VLOOKUP(AC135,$Z$3:$AA173,2)","v":"S1"},""]
[null,"",{"$f":"IF($AE136<>\"\",INDEX(INDIRECT(\"'\"&$AD136&\"'!$B$7:$I$100\"),$AE136,AG$2),\"\")","v":""},{"$f":"IF($AE136<>\"\",INDEX(INDIRECT(\"'\"&$AD136&\"'!$B$7:$I$100\"),$AE136,AH$2),\"\")","v":""},{"$f":"IF($AE136<>\"\",INDEX(INDIRECT(\"'\"&$AD136&\"'!$B$7:$I$100\"),$AE136,AI$2),\"\")","v":""},{"$f":"IF($AE136<>\"\",INDEX(INDIRECT(\"'\"&$AD136&\"'!$B$7:$I$100\"),$AE136,AJ$2),\"\")","v":""},{"$f":"IF($AE136<>\"\",INDEX(INDIRECT(\"'\"&$AD136&\"'!$B$7:$I$100\"),$AE136,AK$2),\"\")","v":""},{"$f":"IF($AE136<>\"\",INDEX(INDIRECT(\"'\"&$AD136&\"'!$B$7:$I$100\"),$AE136,AL$2),\"\")","v":""},{"$f":"IF($AE136<>\"\",INDEX(INDIRECT(\"'\"&$AD136&\"'!$B$7:$I$100\"),$AE136,AM$2),\"\")","v":""},{"$f":"IF($AE136<>\"\",INDEX(INDIRECT(\"'\"&$AD136&\"'!$B$7:$I$100\"),$AE136,AN$2),\"\")","v":""},null,null,null,null,null,null,null,null,null,null,null,{"$f":"IFERROR( INDIRECT(\"'\"&$W136&\"'!$B$4\"), \"\")","v":""},"S134","",false,{"$error":"#VALUE!"},"S134",null,134,{"$f":"VLOOKUP(AC136,$Z$3:$AA174,2)","v":"S1"},""]
[null,"",{"$f":"IF($AE137<>\"\",INDEX(INDIRECT(\"'\"&$AD137&\"'!$B$7:$I$100\"),$AE137,AG$2),\"\")","v":""},{"$f":"IF($AE137<>\"\",INDEX(INDIRECT(\"'\"&$AD137&\"'!$B$7:$I$100\"),$AE137,AH$2),\"\")","v":""},{"$f":"IF($AE137<>\"\",INDEX(INDIRECT(\"'\"&$AD137&\"'!$B$7:$I$100\"),$AE137,AI$2),\"\")","v":""},{"$f":"IF($AE137<>\"\",INDEX(INDIRECT(\"'\"&$AD137&\"'!$B$7:$I$100\"),$AE137,AJ$2),\"\")","v":""},{"$f":"IF($AE137<>\"\",INDEX(INDIRECT(\"'\"&$AD137&\"'!$B$7:$I$100\"),$AE137,AK$2),\"\")","v":""},{"$f":"IF($AE137<>\"\",INDEX(INDIRECT(\"'\"&$AD137&\"'!$B$7:$I$100\"),$AE137,AL$2),\"\")","v":""},{"$f":"IF($AE137<>\"\",INDEX(INDIRECT(\"'\"&$AD137&\"'!$B$7:$I$100\"),$AE137,AM$2),\"\")","v":""},{"$f":"IF($AE137<>\"\",INDEX(INDIRECT(\"'\"&$AD137&\"'!$B$7:$I$100\"),$AE137,AN$2),\"\")","v":""},null,null,null,null,null,null,null,null,null,null,null,{"$f":"IFERROR( INDIRECT(\"'\"&$W137&\"'!$B$4\"), \"\")","v":""},"S135","",false,{"$error":"#VALUE!"},"S135",null,135,{"$f":"VLOOKUP(AC137,$Z$3:$AA175,2)","v":"S1"},""]
[null,"",{"$f":"IF($AE138<>\"\",INDEX(INDIRECT(\"'\"&$AD138&\"'!$B$7:$I$100\"),$AE138,AG$2),\"\")","v":""},{"$f":"IF($AE138<>\"\",INDEX(INDIRECT(\"'\"&$AD138&\"'!$B$7:$I$100\"),$AE138,AH$2),\"\")","v":""},{"$f":"IF($AE138<>\"\",INDEX(INDIRECT(\"'\"&$AD138&\"'!$B$7:$I$100\"),$AE138,AI$2),\"\")","v":""},{"$f":"IF($AE138<>\"\",INDEX(INDIRECT(\"'\"&$AD138&\"'!$B$7:$I$100\"),$AE138,AJ$2),\"\")","v":""},{"$f":"IF($AE138<>\"\",INDEX(INDIRECT(\"'\"&$AD138&\"'!$B$7:$I$100\"),$AE138,AK$2),\"\")","v":""},{"$f":"IF($AE138<>\"\",INDEX(INDIRECT(\"'\"&$AD138&\"'!$B$7:$I$100\"),$AE138,AL$2),\"\")","v":""},{"$f":"IF($AE138<>\"\",INDEX(INDIRECT(\"'\"&$AD138&\"'!$B$7:$I$100\"),$AE138,AM$2),\"\")","v":""},{"$f":"IF($AE138<>\"\",INDEX(INDIRECT(\"'\"&$AD138&\"'!$B$7:$I$100\"),$AE138,AN$2),\"\")","v":""},null,null,null,null,null,null,null,null,null,null,null,{"$f":"IFERROR( INDIRECT(\"'\"&$W138&\"'!$B$4\"), \"\")","v":""},"S136","",false,{"$error":"#VALUE!"},"S136",null,136,{"$f":"VLOOKUP(AC138,$Z$3:$AA176,2)","v":"S1"},""]
[null,"",{"$f":"IF($AE139<>\"\",INDEX(INDIRECT(\"'\"&$AD139&\"'!$B$7:$I$100\"),$AE139,AG$2),\"\")","v":""},{"$f":"IF($AE139<>\"\",INDEX(INDIRECT(\"'\"&$AD139&\"'!$B$7:$I$100\"),$AE139,AH$2),\"\")","v":""},{"$f":"IF($AE139<>\"\",INDEX(INDIRECT(\"'\"&$AD139&\"'!$B$7:$I$100\"),$AE139,AI$2),\"\")","v":""},{"$f":"IF($AE139<>\"\",INDEX(INDIRECT(\"'\"&$AD139&\"'!$B$7:$I$100\"),$AE139,AJ$2),\"\")","v":""},{"$f":"IF($AE139<>\"\",INDEX(INDIRECT(\"'\"&$AD139&\"'!$B$7:$I$100\"),$AE139,AK$2),\"\")","v":""},{"$f":"IF($AE139<>\"\",INDEX(INDIRECT(\"'\"&$AD139&\"'!$B$7:$I$100\"),$AE139,AL$2),\"\")","v":""},{"$f":"IF($AE139<>\"\",INDEX(INDIRECT(\"'\"&$AD139&\"'!$B$7:$I$100\"),$AE139,AM$2),\"\")","v":""},{"$f":"IF($AE139<>\"\",INDEX(INDIRECT(\"'\"&$AD139&\"'!$B$7:$I$100\"),$AE139,AN$2),\"\")","v":""},null,null,null,null,null,null,null,null,null,null,null,{"$f":"IFERROR( INDIRECT(\"'\"&$W139&\"'!$B$4\"), \"\")","v":""},"S137","",false,{"$error":"#VALUE!"},"S137",null,137,{"$f":"VLOOKUP(AC139,$Z$3:$AA177,2)","v":"S1"},""]
[null,"",{"$f":"IF($AE140<>\"\",INDEX(INDIRECT(\"'\"&$AD140&\"'!$B$7:$I$100\"),$AE140,AG$2),\"\")","v":""},{"$f":"IF($AE140<>\"\",INDEX(INDIRECT(\"'\"&$AD140&\"'!$B$7:$I$100\"),$AE140,AH$2),\"\")","v":""},{"$f":"IF($AE140<>\"\",INDEX(INDIRECT(\"'\"&$AD140&\"'!$B$7:$I$100\"),$AE140,AI$2),\"\")","v":""},{"$f":"IF($AE140<>\"\",INDEX(INDIRECT(\"'\"&$AD140&\"'!$B$7:$I$100\"),$AE140,AJ$2),\"\")","v":""},{"$f":"IF($AE140<>\"\",INDEX(INDIRECT(\"'\"&$AD140&\"'!$B$7:$I$100\"),$AE140,AK$2),\"\")","v":""},{"$f":"IF($AE140<>\"\",INDEX(INDIRECT(\"'\"&$AD140&\"'!$B$7:$I$100\"),$AE140,AL$2),\"\")","v":""},{"$f":"IF($AE140<>\"\",INDEX(INDIRECT(\"'\"&$AD140&\"'!$B$7:$I$100\"),$AE140,AM$2),\"\")","v":""},{"$f":"IF($AE140<>\"\",INDEX(INDIRECT(\"'\"&$AD140&\"'!$B$7:$I$100\"),$AE140,AN$2),\"\")","v":""},null,null,null,null,null,null,null,null,null,null,null,{"$f":"IFERROR( INDIRECT(\"'\"&$W140&\"'!$B$4\"), \"\")","v":""},"S138","",false,{"$error":"#VALUE!"},"S138",null,138,{"$f":"VLOOKUP(AC140,$Z$3:$AA178,2)","v":"S1"},""]
[null,"",{"$f":"IF($AE141<>\"\",INDEX(INDIRECT(\"'\"&$AD141&\"'!$B$7:$I$100\"),$AE141,AG$2),\"\")","v":""},{"$f":"IF($AE141<>\"\",INDEX(INDIRECT(\"'\"&$AD141&\"'!$B$7:$I$100\"),$AE141,AH$2),\"\")","v":""},{"$f":"IF($AE141<>\"\",INDEX(INDIRECT(\"'\"&$AD141&\"'!$B$7:$I$100\"),$AE141,AI$2),\"\")","v":""},{"$f":"IF($AE141<>\"\",INDEX(INDIRECT(\"'\"&$AD141&\"'!$B$7:$I$100\"),$AE141,AJ$2),\"\")","v":""},{"$f":"IF($AE141<>\"\",INDEX(INDIRECT(\"'\"&$AD141&\"'!$B$7:$I$100\"),$AE141,AK$2),\"\")","v":""},{"$f":"IF($AE141<>\"\",INDEX(INDIRECT(\"'\"&$AD141&\"'!$B$7:$I$100\"),$AE141,AL$2),\"\")","v":""},{"$f":"IF($AE141<>\"\",INDEX(INDIRECT(\"'\"&$AD141&\"'!$B$7:$I$100\"),$AE141,AM$2),\"\")","v":""},{"$f":"IF($AE141<>\"\",INDEX(INDIRECT(\"'\"&$AD141&\"'!$B$7:$I$100\"),$AE141,AN$2),\"\")","v":""},null,null,null,null,null,null,null,null,null,null,null,{"$f":"IFERROR( INDIRECT(\"'\"&$W141&\"'!$B$4\"), \"\")","v":""},"S139","",false,{"$error":"#VALUE!"},"S139",null,139,{"$f":"VLOOKUP(AC141,$Z$3:$AA179,2)","v":"S1"},""]
[null,"",{"$f":"IF($AE142<>\"\",INDEX(INDIRECT(\"'\"&$AD142&\"'!$B$7:$I$100\"),$AE142,AG$2),\"\")","v":""},{"$f":"IF($AE142<>\"\",INDEX(INDIRECT(\"'\"&$AD142&\"'!$B$7:$I$100\"),$AE142,AH$2),\"\")","v":""},{"$f":"IF($AE142<>\"\",INDEX(INDIRECT(\"'\"&$AD142&\"'!$B$7:$I$100\"),$AE142,AI$2),\"\")","v":""},{"$f":"IF($AE142<>\"\",INDEX(INDIRECT(\"'\"&$AD142&\"'!$B$7:$I$100\"),$AE142,AJ$2),\"\")","v":""},{"$f":"IF($AE142<>\"\",INDEX(INDIRECT(\"'\"&$AD142&\"'!$B$7:$I$100\"),$AE142,AK$2),\"\")","v":""},{"$f":"IF($AE142<>\"\",INDEX(INDIRECT(\"'\"&$AD142&\"'!$B$7:$I$100\"),$AE142,AL$2),\"\")","v":""},{"$f":"IF($AE142<>\"\",INDEX(INDIRECT(\"'\"&$AD142&\"'!$B$7:$I$100\"),$AE142,AM$2),\"\")","v":""},{"$f":"IF($AE142<>\"\",INDEX(INDIRECT(\"'\"&$AD142&\"'!$B$7:$I$100\"),$AE142,AN$2),\"\")","v":""},null,null,null,null,null,null,null,null,null,null,null,{"$f":"IFERROR( INDIRECT(\"'\"&$W142&\"'!$B$4\"), \"\")","v":""},"S140","",false,{"$error":"#VALUE!"},"S140",null,140,{"$f":"VLOOKUP(AC142,$Z$3:$AA180,2)","v":"S1"},""]
[null,"",{"$f":"IF($AE143<>\"\",INDEX(INDIRECT(\"'\"&$AD143&\"'!$B$7:$I$100\"),$AE143,AG$2),\"\")","v":""},{"$f":"IF($AE143<>\"\",INDEX(INDIRECT(\"'\"&$AD143&\"'!$B$7:$I$100\"),$AE143,AH$2),\"\")","v":""},{"$f":"IF($AE143<>\"\",INDEX(INDIRECT(\"'\"&$AD143&\"'!$B$7:$I$100\"),$AE143,AI$2),\"\")","v":""},{"$f":"IF($AE143<>\"\",INDEX(INDIRECT(\"'\"&$AD143&\"'!$B$7:$I$100\"),$AE143,AJ$2),\"\")","v":""},{"$f":"IF($AE143<>\"\",INDEX(INDIRECT(\"'\"&$AD143&\"'!$B$7:$I$100\"),$AE143,AK$2),\"\")","v":""},{"$f":"IF($AE143<>\"\",INDEX(INDIRECT(\"'\"&$AD143&\"'!$B$7:$I$100\"),$AE143,AL$2),\"\")","v":""},{"$f":"IF($AE143<>\"\",INDEX(INDIRECT(\"'\"&$AD143&\"'!$B$7:$I$100\"),$AE143,AM$2),\"\")","v":""},{"$f":"IF($AE143<>\"\",INDEX(INDIRECT(\"'\"&$AD143&\"'!$B$7:$I$100\"),$AE143,AN$2),\"\")","v":""},null,null,null,null,null,null,null,null,null,null,null,{"$f":"IFERROR( INDIRECT(\"'\"&$W143&\"'!$B$4\"), \"\")","v":""},"S141","",false,{"$error":"#VALUE!"},"S141",null,141,{"$f":"VLOOKUP(AC143,$Z$3:$AA181,2)","v":"S1"},""]
[null,"",{"$f":"IF($AE144<>\"\",INDEX(INDIRECT(\"'\"&$AD144&\"'!$B$7:$I$100\"),$AE144,AG$2),\"\")","v":""},{"$f":"IF($AE144<>\"\",INDEX(INDIRECT(\"'\"&$AD144&\"'!$B$7:$I$100\"),$AE144,AH$2),\"\")","v":""},{"$f":"IF($AE144<>\"\",INDEX(INDIRECT(\"'\"&$AD144&\"'!$B$7:$I$100\"),$AE144,AI$2),\"\")","v":""},{"$f":"IF($AE144<>\"\",INDEX(INDIRECT(\"'\"&$AD144&\"'!$B$7:$I$100\"),$AE144,AJ$2),\"\")","v":""},{"$f":"IF($AE144<>\"\",INDEX(INDIRECT(\"'\"&$AD144&\"'!$B$7:$I$100\"),$AE144,AK$2),\"\")","v":""},{"$f":"IF($AE144<>\"\",INDEX(INDIRECT(\"'\"&$AD144&\"'!$B$7:$I$100\"),$AE144,AL$2),\"\")","v":""},{"$f":"IF($AE144<>\"\",INDEX(INDIRECT(\"'\"&$AD144&\"'!$B$7:$I$100\"),$AE144,AM$2),\"\")","v":""},{"$f":"IF($AE144<>\"\",INDEX(INDIRECT(\"'\"&$AD144&\"'!$B$7:$I$100\"),$AE144,AN$2),\"\")","v":""},null,null,null,null,null,null,null,null,null,null,null,{"$f":"IFERROR( INDIRECT(\"'\"&$W144&\"'!$B$4\"), \"\")","v":""},"S142","",false,{"$error":"#VALUE!"},"S142",null,142,{"$f":"VLOOKUP(AC144,$Z$3:$AA182,2)","v":"S1"},""]
[null,"",{"$f":"IF($AE145<>\"\",INDEX(INDIRECT(\"'\"&$AD145&\"'!$B$7:$I$100\"),$AE145,AG$2),\"\")","v":""},{"$f":"IF($AE145<>\"\",INDEX(INDIRECT(\"'\"&$AD145&\"'!$B$7:$I$100\"),$AE145,AH$2),\"\")","v":""},{"$f":"IF($AE145<>\"\",INDEX(INDIRECT(\"'\"&$AD145&\"'!$B$7:$I$100\"),$AE145,AI$2),\"\")","v":""},{"$f":"IF($AE145<>\"\",INDEX(INDIRECT(\"'\"&$AD145&\"'!$B$7:$I$100\"),$AE145,AJ$2),\"\")","v":""},{"$f":"IF($AE145<>\"\",INDEX(INDIRECT(\"'\"&$AD145&\"'!$B$7:$I$100\"),$AE145,AK$2),\"\")","v":""},{"$f":"IF($AE145<>\"\",INDEX(INDIRECT(\"'\"&$AD145&\"'!$B$7:$I$100\"),$AE145,AL$2),\"\")","v":""},{"$f":"IF($AE145<>\"\",INDEX(INDIRECT(\"'\"&$AD145&\"'!$B$7:$I$100\"),$AE145,AM$2),\"\")","v":""},{"$f":"IF($AE145<>\"\",INDEX(INDIRECT(\"'\"&$AD145&\"'!$B$7:$I$100\"),$AE145,AN$2),\"\")","v":""},null,null,null,null,null,null,null,null,null,null,null,{"$f":"IFERROR( INDIRECT(\"'\"&$W145&\"'!$B$4\"), \"\")","v":""},"S143","",false,{"$error":"#VALUE!"},"S143",null,143,{"$f":"VLOOKUP(AC145,$Z$3:$AA183,2)","v":"S1"},""]
[null,"",{"$f":"IF($AE146<>\"\",INDEX(INDIRECT(\"'\"&$AD146&\"'!$B$7:$I$100\"),$AE146,AG$2),\"\")","v":""},{"$f":"IF($AE146<>\"\",INDEX(INDIRECT(\"'\"&$AD146&\"'!$B$7:$I$100\"),$AE146,AH$2),\"\")","v":""},{"$f":"IF($AE146<>\"\",INDEX(INDIRECT(\"'\"&$AD146&\"'!$B$7:$I$100\"),$AE146,AI$2),\"\")","v":""},{"$f":"IF($AE146<>\"\",INDEX(INDIRECT(\"'\"&$AD146&\"'!$B$7:$I$100\"),$AE146,AJ$2),\"\")","v":""},{"$f":"IF($AE146<>\"\",INDEX(INDIRECT(\"'\"&$AD146&\"'!$B$7:$I$100\"),$AE146,AK$2),\"\")","v":""},{"$f":"IF($AE146<>\"\",INDEX(INDIRECT(\"'\"&$AD146&\"'!$B$7:$I$100\"),$AE146,AL$2),\"\")","v":""},{"$f":"IF($AE146<>\"\",INDEX(INDIRECT(\"'\"&$AD146&\"'!$B$7:$I$100\"),$AE146,AM$2),\"\")","v":""},{"$f":"IF($AE146<>\"\",INDEX(INDIRECT(\"'\"&$AD146&\"'!$B$7:$I$100\"),$AE146,AN$2),\"\")","v":""},null,null,null,null,null,null,null,null,null,null,null,{"$f":"IFERROR( INDIRECT(\"'\"&$W146&\"'!$B$4\"), \"\")","v":""},"S144","",false,{"$error":"#VALUE!"},"S144",null,144,{"$f":"VLOOKUP(AC146,$Z$3:$AA184,2)","v":"S1"},""]
[null,"",{"$f":"IF($AE147<>\"\",INDEX(INDIRECT(\"'\"&$AD147&\"'!$B$7:$I$100\"),$AE147,AG$2),\"\")","v":""},{"$f":"IF($AE147<>\"\",INDEX(INDIRECT(\"'\"&$AD147&\"'!$B$7:$I$100\"),$AE147,AH$2),\"\")","v":""},{"$f":"IF($AE147<>\"\",INDEX(INDIRECT(\"'\"&$AD147&\"'!$B$7:$I$100\"),$AE147,AI$2),\"\")","v":""},{"$f":"IF($AE147<>\"\",INDEX(INDIRECT(\"'\"&$AD147&\"'!$B$7:$I$100\"),$AE147,AJ$2),\"\")","v":""},{"$f":"IF($AE147<>\"\",INDEX(INDIRECT(\"'\"&$AD147&\"'!$B$7:$I$100\"),$AE147,AK$2),\"\")","v":""},{"$f":"IF($AE147<>\"\",INDEX(INDIRECT(\"'\"&$AD147&\"'!$B$7:$I$100\"),$AE147,AL$2),\"\")","v":""},{"$f":"IF($AE147<>\"\",INDEX(INDIRECT(\"'\"&$AD147&\"'!$B$7:$I$100\"),$AE147,AM$2),\"\")","v":""},{"$f":"IF($AE147<>\"\",INDEX(INDIRECT(\"'\"&$AD147&\"'!$B$7:$I$100\"),$AE147,AN$2),\"\")","v":""},null,null,null,null,null,null,null,null,null,null,null,{"$f":"IFERROR( INDIRECT(\"'\"&$W147&\"'!$B$4\"), \"\")","v":""},"S145","",false,{"$error":"#VALUE!"},"S145",null,145,{"$f":"VLOOKUP(AC147,$Z$3:$AA185,2)","v":"S1"},""]
[null,"",{"$f":"IF($AE148<>\"\",INDEX(INDIRECT(\"'\"&$AD148&\"'!$B$7:$I$100\"),$AE148,AG$2),\"\")","v":""},{"$f":"IF($AE148<>\"\",INDEX(INDIRECT(\"'\"&$AD148&\"'!$B$7:$I$100\"),$AE148,AH$2),\"\")","v":""},{"$f":"IF($AE148<>\"\",INDEX(INDIRECT(\"'\"&$AD148&\"'!$B$7:$I$100\"),$AE148,AI$2),\"\")","v":""},{"$f":"IF($AE148<>\"\",INDEX(INDIRECT(\"'\"&$AD148&\"'!$B$7:$I$100\"),$AE148,AJ$2),\"\")","v":""},{"$f":"IF($AE148<>\"\",INDEX(INDIRECT(\"'\"&$AD148&\"'!$B$7:$I$100\"),$AE148,AK$2),\"\")","v":""},{"$f":"IF($AE148<>\"\",INDEX(INDIRECT(\"'\"&$AD148&\"'!$B$7:$I$100\"),$AE148,AL$2),\"\")","v":""},{"$f":"IF($AE148<>\"\",INDEX(INDIRECT(\"'\"&$AD148&\"'!$B$7:$I$100\"),$AE148,AM$2),\"\")","v":""},{"$f":"IF($AE148<>\"\",INDEX(INDIRECT(\"'\"&$AD148&\"'!$B$7:$I$100\"),$AE148,AN$2),\"\")","v":""},null,null,null,null,null,null,null,null,null,null,null,{"$f":"IFERROR( INDIRECT(\"'\"&$W148&\"'!$B$4\"), \"\")","v":""},"S146","",false,{"$error":"#VALUE!"},"S146",null,146,{"$f":"VLOOKUP(AC148,$Z$3:$AA186,2)","v":"S1"},""]
[null,"",{"$f":"IF($AE149<>\"\",INDEX(INDIRECT(\"'\"&$AD149&\"'!$B$7:$I$100\"),$AE149,AG$2),\"\")","v":""},{"$f":"IF($AE149<>\"\",INDEX(INDIRECT(\"'\"&$AD149&\"'!$B$7:$I$100\"),$AE149,AH$2),\"\")","v":""},{"$f":"IF($AE149<>\"\",INDEX(INDIRECT(\"'\"&$AD149&\"'!$B$7:$I$100\"),$AE149,AI$2),\"\")","v":""},{"$f":"IF($AE149<>\"\",INDEX(INDIRECT(\"'\"&$AD149&\"'!$B$7:$I$100\"),$AE149,AJ$2),\"\")","v":""},{"$f":"IF($AE149<>\"\",INDEX(INDIRECT(\"'\"&$AD149&\"'!$B$7:$I$100\"),$AE149,AK$2),\"\")","v":""},{"$f":"IF($AE149<>\"\",INDEX(INDIRECT(\"'\"&$AD149&\"'!$B$7:$I$100\"),$AE149,AL$2),\"\")","v":""},{"$f":"IF($AE149<>\"\",INDEX(INDIRECT(\"'\"&$AD149&\"'!$B$7:$I$100\"),$AE149,AM$2),\"\")","v":""},{"$f":"IF($AE149<>\"\",INDEX(INDIRECT(\"'\"&$AD149&\"'!$B$7:$I$100\"),$AE149,AN$2),\"\")","v":""},null,null,null,null,null,null,null,null,null,null,null,{"$f":"IFERROR( INDIRECT(\"'\"&$W149&\"'!$B$4\"), \"\")","v":""},"S147","",false,{"$error":"#VALUE!"},"S147",null,147,{"$f":"VLOOKUP(AC149,$Z$3:$AA187,2)","v":"S1"},""]
[null,"",{"$f":"IF($AE150<>\"\",INDEX(INDIRECT(\"'\"&$AD150&\"'!$B$7:$I$100\"),$AE150,AG$2),\"\")","v":""},{"$f":"IF($AE150<>\"\",INDEX(INDIRECT(\"'\"&$AD150&\"'!$B$7:$I$100\"),$AE150,AH$2),\"\")","v":""},{"$f":"IF($AE150<>\"\",INDEX(INDIRECT(\"'\"&$AD150&\"'!$B$7:$I$100\"),$AE150,AI$2),\"\")","v":""},{"$f":"IF($AE150<>\"\",INDEX(INDIRECT(\"'\"&$AD150&\"'!$B$7:$I$100\"),$AE150,AJ$2),\"\")","v":""},{"$f":"IF($AE150<>\"\",INDEX(INDIRECT(\"'\"&$AD150&\"'!$B$7:$I$100\"),$AE150,AK$2),\"\")","v":""},{"$f":"IF($AE150<>\"\",INDEX(INDIRECT(\"'\"&$AD150&\"'!$B$7:$I$100\"),$AE150,AL$2),\"\")","v":""},{"$f":"IF($AE150<>\"\",INDEX(INDIRECT(\"'\"&$AD150&\"'!$B$7:$I$100\"),$AE150,AM$2),\"\")","v":""},{"$f":"IF($AE150<>\"\",INDEX(INDIRECT(\"'\"&$AD150&\"'!$B$7:$I$100\"),$AE150,AN$2),\"\")","v":""},null,null,null,null,null,null,null,null,null,null,null,{"$f":"IFERROR( INDIRECT(\"'\"&$W150&\"'!$B$4\"), \"\")","v":""},"S148","",false,{"$error":"#VALUE!"},"S148",null,148,{"$f":"VLOOKUP(AC150,$Z$3:$AA188,2)","v":"S1"},""]
[null,"",{"$f":"IF($AE151<>\"\",INDEX(INDIRECT(\"'\"&$AD151&\"'!$B$7:$I$100\"),$AE151,AG$2),\"\")","v":""},{"$f":"IF($AE151<>\"\",INDEX(INDIRECT(\"'\"&$AD151&\"'!$B$7:$I$100\"),$AE151,AH$2),\"\")","v":""},{"$f":"IF($AE151<>\"\",INDEX(INDIRECT(\"'\"&$AD151&\"'!$B$7:$I$100\"),$AE151,AI$2),\"\")","v":""},{"$f":"IF($AE151<>\"\",INDEX(INDIRECT(\"'\"&$AD151&\"'!$B$7:$I$100\"),$AE151,AJ$2),\"\")","v":""},{"$f":"IF($AE151<>\"\",INDEX(INDIRECT(\"'\"&$AD151&\"'!$B$7:$I$100\"),$AE151,AK$2),\"\")","v":""},{"$f":"IF($AE151<>\"\",INDEX(INDIRECT(\"'\"&$AD151&\"'!$B$7:$I$100\"),$AE151,AL$2),\"\")","v":""},{"$f":"IF($AE151<>\"\",INDEX(INDIRECT(\"'\"&$AD151&\"'!$B$7:$I$100\"),$AE151,AM$2),\"\")","v":""},{"$f":"IF($AE151<>\"\",INDEX(INDIRECT(\"'\"&$AD151&\"'!$B$7:$I$100\"),$AE151,AN$2),\"\")","v":""},null,null,null,null,null,null,null,null,null,null,null,{"$f":"IFERROR( INDIRECT(\"'\"&$W151&\"'!$B$4\"), \"\")","v":""},"S149","",false,{"$error":"#VALUE!"},"S149",null,149,{"$f":"VLOOKUP(AC151,$Z$3:$AA189,2)","v":"S1"},""]
[null,"",{"$f":"IF($AE152<>\"\",INDEX(INDIRECT(\"'\"&$AD152&\"'!$B$7:$I$100\"),$AE152,AG$2),\"\")","v":""},{"$f":"IF($AE152<>\"\",INDEX(INDIRECT(\"'\"&$AD152&\"'!$B$7:$I$100\"),$AE152,AH$2),\"\")","v":""},{"$f":"IF($AE152<>\"\",INDEX(INDIRECT(\"'\"&$AD152&\"'!$B$7:$I$100\"),$AE152,AI$2),\"\")","v":""},{"$f":"IF($AE152<>\"\",INDEX(INDIRECT(\"'\"&$AD152&\"'!$B$7:$I$100\"),$AE152,AJ$2),\"\")","v":""},{"$f":"IF($AE152<>\"\",INDEX(INDIRECT(\"'\"&$AD152&\"'!$B$7:$I$100\"),$AE152,AK$2),\"\")","v":""},{"$f":"IF($AE152<>\"\",INDEX(INDIRECT(\"'\"&$AD152&\"'!$B$7:$I$100\"),$AE152,AL$2),\"\")","v":""},{"$f":"IF($AE152<>\"\",INDEX(INDIRECT(\"'\"&$AD152&\"'!$B$7:$I$100\"),$AE152,AM$2),\"\")","v":""},{"$f":"IF($AE152<>\"\",INDEX(INDIRECT(\"'\"&$AD152&\"'!$B$7:$I$100\"),$AE152,AN$2),\"\")","v":""},null,null,null,null,null,null,null,null,null,null,null,{"$f":"IFERROR( INDIRECT(\"'\"&$W152&\"'!$B$4\"), \"\")","v":""},"S150","",false,{"$error":"#VALUE!"},"S150",null,150,{"$f":"VLOOKUP(AC152,$Z$3:$AA190,2)","v":"S1"},""]
[null,"",{"$f":"IF($AE153<>\"\",INDEX(INDIRECT(\"'\"&$AD153&\"'!$B$7:$I$100\"),$AE153,AG$2),\"\")","v":""},{"$f":"IF($AE153<>\"\",INDEX(INDIRECT(\"'\"&$AD153&\"'!$B$7:$I$100\"),$AE153,AH$2),\"\")","v":""},{"$f":"IF($AE153<>\"\",INDEX(INDIRECT(\"'\"&$AD153&\"'!$B$7:$I$100\"),$AE153,AI$2),\"\")","v":""},{"$f":"IF($AE153<>\"\",INDEX(INDIRECT(\"'\"&$AD153&\"'!$B$7:$I$100\"),$AE153,AJ$2),\"\")","v":""},{"$f":"IF($AE153<>\"\",INDEX(INDIRECT(\"'\"&$AD153&\"'!$B$7:$I$100\"),$AE153,AK$2),\"\")","v":""},{"$f":"IF($AE153<>\"\",INDEX(INDIRECT(\"'\"&$AD153&\"'!$B$7:$I$100\"),$AE153,AL$2),\"\")","v":""},{"$f":"IF($AE153<>\"\",INDEX(INDIRECT(\"'\"&$AD153&\"'!$B$7:$I$100\"),$AE153,AM$2),\"\")","v":""},{"$f":"IF($AE153<>\"\",INDEX(INDIRECT(\"'\"&$AD153&\"'!$B$7:$I$100\"),$AE153,AN$2),\"\")","v":""},null,null,null,null,null,null,null,null,null,null,null,{"$f":"IFERROR( INDIRECT(\"'\"&$W153&\"'!$B$4\"), \"\")","v":""},"S151","",false,{"$error":"#VALUE!"},"S151",null,151,{"$f":"VLOOKUP(AC153,$Z$3:$AA191,2)","v":"S1"},""]
[null,"",{"$f":"IF($AE154<>\"\",INDEX(INDIRECT(\"'\"&$AD154&\"'!$B$7:$I$100\"),$AE154,AG$2),\"\")","v":""},{"$f":"IF($AE154<>\"\",INDEX(INDIRECT(\"'\"&$AD154&\"'!$B$7:$I$100\"),$AE154,AH$2),\"\")","v":""},{"$f":"IF($AE154<>\"\",INDEX(INDIRECT(\"'\"&$AD154&\"'!$B$7:$I$100\"),$AE154,AI$2),\"\")","v":""},{"$f":"IF($AE154<>\"\",INDEX(INDIRECT(\"'\"&$AD154&\"'!$B$7:$I$100\"),$AE154,AJ$2),\"\")","v":""},{"$f":"IF($AE154<>\"\",INDEX(INDIRECT(\"'\"&$AD154&\"'!$B$7:$I$100\"),$AE154,AK$2),\"\")","v":""},{"$f":"IF($AE154<>\"\",INDEX(INDIRECT(\"'\"&$AD154&\"'!$B$7:$I$100\"),$AE154,AL$2),\"\")","v":""},{"$f":"IF($AE154<>\"\",INDEX(INDIRECT(\"'\"&$AD154&\"'!$B$7:$I$100\"),$AE154,AM$2),\"\")","v":""},{"$f":"IF($AE154<>\"\",INDEX(INDIRECT(\"'\"&$AD154&\"'!$B$7:$I$100\"),$AE154,AN$2),\"\")","v":""},null,null,null,null,null,null,null,null,null,null,null,{"$f":"IFERROR( INDIRECT(\"'\"&$W154&\"'!$B$4\"), \"\")","v":""},"S152","",false,{"$error":"#VALUE!"},"S152",null,152,{"$f":"VLOOKUP(AC154,$Z$3:$AA192,2)","v":"S1"},""]
[null,"",{"$f":"IF($AE155<>\"\",INDEX(INDIRECT(\"'\"&$AD155&\"'!$B$7:$I$100\"),$AE155,AG$2),\"\")","v":""},{"$f":"IF($AE155<>\"\",INDEX(INDIRECT(\"'\"&$AD155&\"'!$B$7:$I$100\"),$AE155,AH$2),\"\")","v":""},{"$f":"IF($AE155<>\"\",INDEX(INDIRECT(\"'\"&$AD155&\"'!$B$7:$I$100\"),$AE155,AI$2),\"\")","v":""},{"$f":"IF($AE155<>\"\",INDEX(INDIRECT(\"'\"&$AD155&\"'!$B$7:$I$100\"),$AE155,AJ$2),\"\")","v":""},{"$f":"IF($AE155<>\"\",INDEX(INDIRECT(\"'\"&$AD155&\"'!$B$7:$I$100\"),$AE155,AK$2),\"\")","v":""},{"$f":"IF($AE155<>\"\",INDEX(INDIRECT(\"'\"&$AD155&\"'!$B$7:$I$100\"),$AE155,AL$2),\"\")","v":""},{"$f":"IF($AE155<>\"\",INDEX(INDIRECT(\"'\"&$AD155&\"'!$B$7:$I$100\"),$AE155,AM$2),\"\")","v":""},{"$f":"IF($AE155<>\"\",INDEX(INDIRECT(\"'\"&$AD155&\"'!$B$7:$I$100\"),$AE155,AN$2),\"\")","v":""},null,null,null,null,null,null,null,null,null,null,null,{"$f":"IFERROR( INDIRECT(\"'\"&$W155&\"'!$B$4\"), \"\")","v":""},"S153","",false,{"$error":"#VALUE!"},"S153",null,153,{"$f":"VLOOKUP(AC155,$Z$3:$AA193,2)","v":"S1"},""]
[null,"",{"$f":"IF($AE156<>\"\",INDEX(INDIRECT(\"'\"&$AD156&\"'!$B$7:$I$100\"),$AE156,AG$2),\"\")","v":""},{"$f":"IF($AE156<>\"\",INDEX(INDIRECT(\"'\"&$AD156&\"'!$B$7:$I$100\"),$AE156,AH$2),\"\")","v":""},{"$f":"IF($AE156<>\"\",INDEX(INDIRECT(\"'\"&$AD156&\"'!$B$7:$I$100\"),$AE156,AI$2),\"\")","v":""},{"$f":"IF($AE156<>\"\",INDEX(INDIRECT(\"'\"&$AD156&\"'!$B$7:$I$100\"),$AE156,AJ$2),\"\")","v":""},{"$f":"IF($AE156<>\"\",INDEX(INDIRECT(\"'\"&$AD156&\"'!$B$7:$I$100\"),$AE156,AK$2),\"\")","v":""},{"$f":"IF($AE156<>\"\",INDEX(INDIRECT(\"'\"&$AD156&\"'!$B$7:$I$100\"),$AE156,AL$2),\"\")","v":""},{"$f":"IF($AE156<>\"\",INDEX(INDIRECT(\"'\"&$AD156&\"'!$B$7:$I$100\"),$AE156,AM$2),\"\")","v":""},{"$f":"IF($AE156<>\"\",INDEX(INDIRECT(\"'\"&$AD156&\"'!$B$7:$I$100\"),$AE156,AN$2),\"\")","v":""},null,null,null,null,null,null,null,null,null,null,null,{"$f":"IFERROR( INDIRECT(\"'\"&$W156&\"'!$B$4\"), \"\")","v":""},"S154","",false,{"$error":"#VALUE!"},"S154",null,154,{"$f":"VLOOKUP(AC156,$Z$3:$AA194,2)","v":"S1"},""]
[null,"",{"$f":"IF($AE157<>\"\",INDEX(INDIRECT(\"'\"&$AD157&\"'!$B$7:$I$100\"),$AE157,AG$2),\"\")","v":""},{"$f":"IF($AE157<>\"\",INDEX(INDIRECT(\"'\"&$AD157&\"'!$B$7:$I$100\"),$AE157,AH$2),\"\")","v":""},{"$f":"IF($AE157<>\"\",INDEX(INDIRECT(\"'\"&$AD157&\"'!$B$7:$I$100\"),$AE157,AI$2),\"\")","v":""},{"$f":"IF($AE157<>\"\",INDEX(INDIRECT(\"'\"&$AD157&\"'!$B$7:$I$100\"),$AE157,AJ$2),\"\")","v":""},{"$f":"IF($AE157<>\"\",INDEX(INDIRECT(\"'\"&$AD157&\"'!$B$7:$I$100\"),$AE157,AK$2),\"\")","v":""},{"$f":"IF($AE157<>\"\",INDEX(INDIRECT(\"'\"&$AD157&\"'!$B$7:$I$100\"),$AE157,AL$2),\"\")","v":""},{"$f":"IF($AE157<>\"\",INDEX(INDIRECT(\"'\"&$AD157&\"'!$B$7:$I$100\"),$AE157,AM$2),\"\")","v":""},{"$f":"IF($AE157<>\"\",INDEX(INDIRECT(\"'\"&$AD157&\"'!$B$7:$I$100\"),$AE157,AN$2),\"\")","v":""},null,null,null,null,null,null,null,null,null,null,null,{"$f":"IFERROR( INDIRECT(\"'\"&$W157&\"'!$B$4\"), \"\")","v":""},"S155","",false,{"$error":"#VALUE!"},"S155",null,155,{"$f":"VLOOKUP(AC157,$Z$3:$AA195,2)","v":"S1"},""]
[null,"",{"$f":"IF($AE158<>\"\",INDEX(INDIRECT(\"'\"&$AD158&\"'!$B$7:$I$100\"),$AE158,AG$2),\"\")","v":""},{"$f":"IF($AE158<>\"\",INDEX(INDIRECT(\"'\"&$AD158&\"'!$B$7:$I$100\"),$AE158,AH$2),\"\")","v":""},{"$f":"IF($AE158<>\"\",INDEX(INDIRECT(\"'\"&$AD158&\"'!$B$7:$I$100\"),$AE158,AI$2),\"\")","v":""},{"$f":"IF($AE158<>\"\",INDEX(INDIRECT(\"'\"&$AD158&\"'!$B$7:$I$100\"),$AE158,AJ$2),\"\")","v":""},{"$f":"IF($AE158<>\"\",INDEX(INDIRECT(\"'\"&$AD158&\"'!$B$7:$I$100\"),$AE158,AK$2),\"\")","v":""},{"$f":"IF($AE158<>\"\",INDEX(INDIRECT(\"'\"&$AD158&\"'!$B$7:$I$100\"),$AE158,AL$2),\"\")","v":""},{"$f":"IF($AE158<>\"\",INDEX(INDIRECT(\"'\"&$AD158&\"'!$B$7:$I$100\"),$AE158,AM$2),\"\")","v":""},{"$f":"IF($AE158<>\"\",INDEX(INDIRECT(\"'\"&$AD158&\"'!$B$7:$I$100\"),$AE158,AN$2),\"\")","v":""},null,null,null,null,null,null,null,null,null,null,null,{"$f":"IFERROR( INDIRECT(\"'\"&$W158&\"'!$B$4\"), \"\")","v":""},"S156","",false,{"$error":"#VALUE!"},"S156",null,156,{"$f":"VLOOKUP(AC158,$Z$3:$AA196,2)","v":"S1"},""]
[null,"",{"$f":"IF($AE159<>\"\",INDEX(INDIRECT(\"'\"&$AD159&\"'!$B$7:$I$100\"),$AE159,AG$2),\"\")","v":""},{"$f":"IF($AE159<>\"\",INDEX(INDIRECT(\"'\"&$AD159&\"'!$B$7:$I$100\"),$AE159,AH$2),\"\")","v":""},{"$f":"IF($AE159<>\"\",INDEX(INDIRECT(\"'\"&$AD159&\"'!$B$7:$I$100\"),$AE159,AI$2),\"\")","v":""},{"$f":"IF($AE159<>\"\",INDEX(INDIRECT(\"'\"&$AD159&\"'!$B$7:$I$100\"),$AE159,AJ$2),\"\")","v":""},{"$f":"IF($AE159<>\"\",INDEX(INDIRECT(\"'\"&$AD159&\"'!$B$7:$I$100\"),$AE159,AK$2),\"\")","v":""},{"$f":"IF($AE159<>\"\",INDEX(INDIRECT(\"'\"&$AD159&\"'!$B$7:$I$100\"),$AE159,AL$2),\"\")","v":""},{"$f":"IF($AE159<>\"\",INDEX(INDIRECT(\"'\"&$AD159&\"'!$B$7:$I$100\"),$AE159,AM$2),\"\")","v":""},{"$f":"IF($AE159<>\"\",INDEX(INDIRECT(\"'\"&$AD159&\"'!$B$7:$I$100\"),$AE159,AN$2),\"\")","v":""},null,null,null,null,null,null,null,null,null,null,null,{"$f":"IFERROR( INDIRECT(\"'\"&$W159&\"'!$B$4\"), \"\")","v":""},"S157","",false,{"$error":"#VALUE!"},"S157",null,157,{"$f":"VLOOKUP(AC159,$Z$3:$AA197,2)","v":"S1"},""]
[null,"",{"$f":"IF($AE160<>\"\",INDEX(INDIRECT(\"'\"&$AD160&\"'!$B$7:$I$100\"),$AE160,AG$2),\"\")","v":""},{"$f":"IF($AE160<>\"\",INDEX(INDIRECT(\"'\"&$AD160&\"'!$B$7:$I$100\"),$AE160,AH$2),\"\")","v":""},{"$f":"IF($AE160<>\"\",INDEX(INDIRECT(\"'\"&$AD160&\"'!$B$7:$I$100\"),$AE160,AI$2),\"\")","v":""},{"$f":"IF($AE160<>\"\",INDEX(INDIRECT(\"'\"&$AD160&\"'!$B$7:$I$100\"),$AE160,AJ$2),\"\")","v":""},{"$f":"IF($AE160<>\"\",INDEX(INDIRECT(\"'\"&$AD160&\"'!$B$7:$I$100\"),$AE160,AK$2),\"\")","v":""},{"$f":"IF($AE160<>\"\",INDEX(INDIRECT(\"'\"&$AD160&\"'!$B$7:$I$100\"),$AE160,AL$2),\"\")","v":""},{"$f":"IF($AE160<>\"\",INDEX(INDIRECT(\"'\"&$AD160&\"'!$B$7:$I$100\"),$AE160,AM$2),\"\")","v":""},{"$f":"IF($AE160<>\"\",INDEX(INDIRECT(\"'\"&$AD160&\"'!$B$7:$I$100\"),$AE160,AN$2),\"\")","v":""},null,null,null,null,null,null,null,null,null,null,null,{"$f":"IFERROR( INDIRECT(\"'\"&$W160&\"'!$B$4\"), \"\")","v":""},"S158","",false,{"$error":"#VALUE!"},"S158",null,158,{"$f":"VLOOKUP(AC160,$Z$3:$AA198,2)","v":"S1"},""]
[null,"",{"$f":"IF($AE161<>\"\",INDEX(INDIRECT(\"'\"&$AD161&\"'!$B$7:$I$100\"),$AE161,AG$2),\"\")","v":""},{"$f":"IF($AE161<>\"\",INDEX(INDIRECT(\"'\"&$AD161&\"'!$B$7:$I$100\"),$AE161,AH$2),\"\")","v":""},{"$f":"IF($AE161<>\"\",INDEX(INDIRECT(\"'\"&$AD161&\"'!$B$7:$I$100\"),$AE161,AI$2),\"\")","v":""},{"$f":"IF($AE161<>\"\",INDEX(INDIRECT(\"'\"&$AD161&\"'!$B$7:$I$100\"),$AE161,AJ$2),\"\")","v":""},{"$f":"IF($AE161<>\"\",INDEX(INDIRECT(\"'\"&$AD161&\"'!$B$7:$I$100\"),$AE161,AK$2),\"\")","v":""},{"$f":"IF($AE161<>\"\",INDEX(INDIRECT(\"'\"&$AD161&\"'!$B$7:$I$100\"),$AE161,AL$2),\"\")","v":""},{"$f":"IF($AE161<>\"\",INDEX(INDIRECT(\"'\"&$AD161&\"'!$B$7:$I$100\"),$AE161,AM$2),\"\")","v":""},{"$f":"IF($AE161<>\"\",INDEX(INDIRECT(\"'\"&$AD161&\"'!$B$7:$I$100\"),$AE161,AN$2),\"\")","v":""},null,null,null,null,null,null,null,null,null,null,null,{"$f":"IFERROR( INDIRECT(\"'\"&$W161&\"'!$B$4\"), \"\")","v":""},"S159","",false,{"$error":"#VALUE!"},"S159",null,159,{"$f":"VLOOKUP(AC161,$Z$3:$AA199,2)","v":"S1"},""]
[null,"",{"$f":"IF($AE162<>\"\",INDEX(INDIRECT(\"'\"&$AD162&\"'!$B$7:$I$100\"),$AE162,AG$2),\"\")","v":""},{"$f":"IF($AE162<>\"\",INDEX(INDIRECT(\"'\"&$AD162&\"'!$B$7:$I$100\"),$AE162,AH$2),\"\")","v":""},{"$f":"IF($AE162<>\"\",INDEX(INDIRECT(\"'\"&$AD162&\"'!$B$7:$I$100\"),$AE162,AI$2),\"\")","v":""},{"$f":"IF($AE162<>\"\",INDEX(INDIRECT(\"'\"&$AD162&\"'!$B$7:$I$100\"),$AE162,AJ$2),\"\")","v":""},{"$f":"IF($AE162<>\"\",INDEX(INDIRECT(\"'\"&$AD162&\"'!$B$7:$I$100\"),$AE162,AK$2),\"\")","v":""},{"$f":"IF($AE162<>\"\",INDEX(INDIRECT(\"'\"&$AD162&\"'!$B$7:$I$100\"),$AE162,AL$2),\"\")","v":""},{"$f":"IF($AE162<>\"\",INDEX(INDIRECT(\"'\"&$AD162&\"'!$B$7:$I$100\"),$AE162,AM$2),\"\")","v":""},{"$f":"IF($AE162<>\"\",INDEX(INDIRECT(\"'\"&$AD162&\"'!$B$7:$I$100\"),$AE162,AN$2),\"\")","v":""},null,null,null,null,null,null,null,null,null,null,null,{"$f":"IFERROR( INDIRECT(\"'\"&$W162&\"'!$B$4\"), \"\")","v":""},"S160","",false,{"$error":"#VALUE!"},"S160",null,160,{"$f":"VLOOKUP(AC162,$Z$3:$AA200,2)","v":"S1"},""]
[null,"",{"$f":"IF($AE163<>\"\",INDEX(INDIRECT(\"'\"&$AD163&\"'!$B$7:$I$100\"),$AE163,AG$2),\"\")","v":""},{"$f":"IF($AE163<>\"\",INDEX(INDIRECT(\"'\"&$AD163&\"'!$B$7:$I$100\"),$AE163,AH$2),\"\")","v":""},{"$f":"IF($AE163<>\"\",INDEX(INDIRECT(\"'\"&$AD163&\"'!$B$7:$I$100\"),$AE163,AI$2),\"\")","v":""},{"$f":"IF($AE163<>\"\",INDEX(INDIRECT(\"'\"&$AD163&\"'!$B$7:$I$100\"),$AE163,AJ$2),\"\")","v":""},{"$f":"IF($AE163<>\"\",INDEX(INDIRECT(\"'\"&$AD163&\"'!$B$7:$I$100\"),$AE163,AK$2),\"\")","v":""},{"$f":"IF($AE163<>\"\",INDEX(INDIRECT(\"'\"&$AD163&\"'!$B$7:$I$100\"),$AE163,AL$2),\"\")","v":""},{"$f":"IF($AE163<>\"\",INDEX(INDIRECT(\"'\"&$AD163&\"'!$B$7:$I$100\"),$AE163,AM$2),\"\")","v":""},{"$f":"IF($AE163<>\"\",INDEX(INDIRECT(\"'\"&$AD163&\"'!$B$7:$I$100\"),$AE163,AN$2),\"\")","v":""},null,null,null,null,null,null,null,null,null,null,null,{"$f":"IFERROR( INDIRECT(\"'\"&$W163&\"'!$B$4\"), \"\")","v":""},"S161","",false,{"$error":"#VALUE!"},"S161",null,161,{"$f":"VLOOKUP(AC163,$Z$3:$AA201,2)","v":"S1"},""]
[null,"",{"$f":"IF($AE164<>\"\",INDEX(INDIRECT(\"'\"&$AD164&\"'!$B$7:$I$100\"),$AE164,AG$2),\"\")","v":""},{"$f":"IF($AE164<>\"\",INDEX(INDIRECT(\"'\"&$AD164&\"'!$B$7:$I$100\"),$AE164,AH$2),\"\")","v":""},{"$f":"IF($AE164<>\"\",INDEX(INDIRECT(\"'\"&$AD164&\"'!$B$7:$I$100\"),$AE164,AI$2),\"\")","v":""},{"$f":"IF($AE164<>\"\",INDEX(INDIRECT(\"'\"&$AD164&\"'!$B$7:$I$100\"),$AE164,AJ$2),\"\")","v":""},{"$f":"IF($AE164<>\"\",INDEX(INDIRECT(\"'\"&$AD164&\"'!$B$7:$I$100\"),$AE164,AK$2),\"\")","v":""},{"$f":"IF($AE164<>\"\",INDEX(INDIRECT(\"'\"&$AD164&\"'!$B$7:$I$100\"),$AE164,AL$2),\"\")","v":""},{"$f":"IF($AE164<>\"\",INDEX(INDIRECT(\"'\"&$AD164&\"'!$B$7:$I$100\"),$AE164,AM$2),\"\")","v":""},{"$f":"IF($AE164<>\"\",INDEX(INDIRECT(\"'\"&$AD164&\"'!$B$7:$I$100\"),$AE164,AN$2),\"\")","v":""},null,null,null,null,null,null,null,null,null,null,null,{"$f":"IFERROR( INDIRECT(\"'\"&$W164&\"'!$B$4\"), \"\")","v":""},"S162","",false,{"$error":"#VALUE!"},"S162",null,162,{"$f":"VLOOKUP(AC164,$Z$3:$AA202,2)","v":"S1"},""]
[null,"",{"$f":"IF($AE165<>\"\",INDEX(INDIRECT(\"'\"&$AD165&\"'!$B$7:$I$100\"),$AE165,AG$2),\"\")","v":""},{"$f":"IF($AE165<>\"\",INDEX(INDIRECT(\"'\"&$AD165&\"'!$B$7:$I$100\"),$AE165,AH$2),\"\")","v":""},{"$f":"IF($AE165<>\"\",INDEX(INDIRECT(\"'\"&$AD165&\"'!$B$7:$I$100\"),$AE165,AI$2),\"\")","v":""},{"$f":"IF($AE165<>\"\",INDEX(INDIRECT(\"'\"&$AD165&\"'!$B$7:$I$100\"),$AE165,AJ$2),\"\")","v":""},{"$f":"IF($AE165<>\"\",INDEX(INDIRECT(\"'\"&$AD165&\"'!$B$7:$I$100\"),$AE165,AK$2),\"\")","v":""},{"$f":"IF($AE165<>\"\",INDEX(INDIRECT(\"'\"&$AD165&\"'!$B$7:$I$100\"),$AE165,AL$2),\"\")","v":""},{"$f":"IF($AE165<>\"\",INDEX(INDIRECT(\"'\"&$AD165&\"'!$B$7:$I$100\"),$AE165,AM$2),\"\")","v":""},{"$f":"IF($AE165<>\"\",INDEX(INDIRECT(\"'\"&$AD165&\"'!$B$7:$I$100\"),$AE165,AN$2),\"\")","v":""},null,null,null,null,null,null,null,null,null,null,null,{"$f":"IFERROR( INDIRECT(\"'\"&$W165&\"'!$B$4\"), \"\")","v":""},"S163","",false,{"$error":"#VALUE!"},"S163",null,163,{"$f":"VLOOKUP(AC165,$Z$3:$AA203,2)","v":"S1"},""]
[null,"",{"$f":"IF($AE166<>\"\",INDEX(INDIRECT(\"'\"&$AD166&\"'!$B$7:$I$100\"),$AE166,AG$2),\"\")","v":""},{"$f":"IF($AE166<>\"\",INDEX(INDIRECT(\"'\"&$AD166&\"'!$B$7:$I$100\"),$AE166,AH$2),\"\")","v":""},{"$f":"IF($AE166<>\"\",INDEX(INDIRECT(\"'\"&$AD166&\"'!$B$7:$I$100\"),$AE166,AI$2),\"\")","v":""},{"$f":"IF($AE166<>\"\",INDEX(INDIRECT(\"'\"&$AD166&\"'!$B$7:$I$100\"),$AE166,AJ$2),\"\")","v":""},{"$f":"IF($AE166<>\"\",INDEX(INDIRECT(\"'\"&$AD166&\"'!$B$7:$I$100\"),$AE166,AK$2),\"\")","v":""},{"$f":"IF($AE166<>\"\",INDEX(INDIRECT(\"'\"&$AD166&\"'!$B$7:$I$100\"),$AE166,AL$2),\"\")","v":""},{"$f":"IF($AE166<>\"\",INDEX(INDIRECT(\"'\"&$AD166&\"'!$B$7:$I$100\"),$AE166,AM$2),\"\")","v":""},{"$f":"IF($AE166<>\"\",INDEX(INDIRECT(\"'\"&$AD166&\"'!$B$7:$I$100\"),$AE166,AN$2),\"\")","v":""},null,null,null,null,null,null,null,null,null,null,null,{"$f":"IFERROR( INDIRECT(\"'\"&$W166&\"'!$B$4\"), \"\")","v":""},"S164","",false,{"$error":"#VALUE!"},"S164",null,164,{"$f":"VLOOKUP(AC166,$Z$3:$AA204,2)","v":"S1"},""]
[null,"",{"$f":"IF($AE167<>\"\",INDEX(INDIRECT(\"'\"&$AD167&\"'!$B$7:$I$100\"),$AE167,AG$2),\"\")","v":""},{"$f":"IF($AE167<>\"\",INDEX(INDIRECT(\"'\"&$AD167&\"'!$B$7:$I$100\"),$AE167,AH$2),\"\")","v":""},{"$f":"IF($AE167<>\"\",INDEX(INDIRECT(\"'\"&$AD167&\"'!$B$7:$I$100\"),$AE167,AI$2),\"\")","v":""},{"$f":"IF($AE167<>\"\",INDEX(INDIRECT(\"'\"&$AD167&\"'!$B$7:$I$100\"),$AE167,AJ$2),\"\")","v":""},{"$f":"IF($AE167<>\"\",INDEX(INDIRECT(\"'\"&$AD167&\"'!$B$7:$I$100\"),$AE167,AK$2),\"\")","v":""},{"$f":"IF($AE167<>\"\",INDEX(INDIRECT(\"'\"&$AD167&\"'!$B$7:$I$100\"),$AE167,AL$2),\"\")","v":""},{"$f":"IF($AE167<>\"\",INDEX(INDIRECT(\"'\"&$AD167&\"'!$B$7:$I$100\"),$AE167,AM$2),\"\")","v":""},{"$f":"IF($AE167<>\"\",INDEX(INDIRECT(\"'\"&$AD167&\"'!$B$7:$I$100\"),$AE167,AN$2),\"\")","v":""},null,null,null,null,null,null,null,null,null,null,null,{"$f":"IFERROR( INDIRECT(\"'\"&$W167&\"'!$B$4\"), \"\")","v":""},"S165",{"$f":"V167","v":""},false,{"$f":"AB166+Z166","v":{"$error":"#VALUE!"}},"S165",null,165,{"$f":"VLOOKUP(AC167,$Z$3:$AA205,2)","v":"S1"},{"$f":"IF(VLOOKUP(AD167,$W$3:$AD$102,3,FALSE)=TRUE,IF(AD167=AD166,AE166+1,1),\"\")","v":""}]
[null,"",{"$f":"IF($AE168<>\"\",INDEX(INDIRECT(\"'\"&$AD168&\"'!$B$7:$I$100\"),$AE168,AG$2),\"\")","v":""},{"$f":"IF($AE168<>\"\",INDEX(INDIRECT(\"'\"&$AD168&\"'!$B$7:$I$100\"),$AE168,AH$2),\"\")","v":""},{"$f":"IF($AE168<>\"\",INDEX(INDIRECT(\"'\"&$AD168&\"'!$B$7:$I$100\"),$AE168,AI$2),\"\")","v":""},{"$f":"IF($AE168<>\"\",INDEX(INDIRECT(\"'\"&$AD168&\"'!$B$7:$I$100\"),$AE168,AJ$2),\"\")","v":""},{"$f":"IF($AE168<>\"\",INDEX(INDIRECT(\"'\"&$AD168&\"'!$B$7:$I$100\"),$AE168,AK$2),\"\")","v":""},{"$f":"IF($AE168<>\"\",INDEX(INDIRECT(\"'\"&$AD168&\"'!$B$7:$I$100\"),$AE168,AL$2),\"\")","v":""},{"$f":"IF($AE168<>\"\",INDEX(INDIRECT(\"'\"&$AD168&\"'!$B$7:$I$100\"),$AE168,AM$2),\"\")","v":""},{"$f":"IF($AE168<>\"\",INDEX(INDIRECT(\"'\"&$AD168&\"'!$B$7:$I$100\"),$AE168,AN$2),\"\")","v":""},null,null,null,null,null,null,null,null,null,null,null,{"$f":"IFERROR( INDIRECT(\"'\"&$W168&\"'!$B$4\"), \"\")","v":""},"S166","",false,{"$error":"#VALUE!"},"S166",null,166,{"$f":"VLOOKUP(AC168,$Z$3:$AA206,2)","v":"S1"},""]
[null,"",{"$f":"IF($AE169<>\"\",INDEX(INDIRECT(\"'\"&$AD169&\"'!$B$7:$I$100\"),$AE169,AG$2),\"\")","v":""},{"$f":"IF($AE169<>\"\",INDEX(INDIRECT(\"'\"&$AD169&\"'!$B$7:$I$100\"),$AE169,AH$2),\"\")","v":""},{"$f":"IF($AE169<>\"\",INDEX(INDIRECT(\"'\"&$AD169&\"'!$B$7:$I$100\"),$AE169,AI$2),\"\")","v":""},{"$f":"IF($AE169<>\"\",INDEX(INDIRECT(\"'\"&$AD169&\"'!$B$7:$I$100\"),$AE169,AJ$2),\"\")","v":""},{"$f":"IF($AE169<>\"\",INDEX(INDIRECT(\"'\"&$AD169&\"'!$B$7:$I$100\"),$AE169,AK$2),\"\")","v":""},{"$f":"IF($AE169<>\"\",INDEX(INDIRECT(\"'\"&$AD169&\"'!$B$7:$I$100\"),$AE169,AL$2),\"\")","v":""},{"$f":"IF($AE169<>\"\",INDEX(INDIRECT(\"'\"&$AD169&\"'!$B$7:$I$100\"),$AE169,AM$2),\"\")","v":""},{"$f":"IF($AE169<>\"\",INDEX(INDIRECT(\"'\"&$AD169&\"'!$B$7:$I$100\"),$AE169,AN$2),\"\")","v":""},null,null,null,null,null,null,null,null,null,null,null,{"$f":"IFERROR( INDIRECT(\"'\"&$W169&\"'!$B$4\"), \"\")","v":""},"S167","",false,{"$error":"#VALUE!"},"S167",null,167,{"$f":"VLOOKUP(AC169,$Z$3:$AA207,2)","v":"S1"},""]
[null,"",{"$f":"IF($AE170<>\"\",INDEX(INDIRECT(\"'\"&$AD170&\"'!$B$7:$I$100\"),$AE170,AG$2),\"\")","v":""},{"$f":"IF($AE170<>\"\",INDEX(INDIRECT(\"'\"&$AD170&\"'!$B$7:$I$100\"),$AE170,AH$2),\"\")","v":""},{"$f":"IF($AE170<>\"\",INDEX(INDIRECT(\"'\"&$AD170&\"'!$B$7:$I$100\"),$AE170,AI$2),\"\")","v":""},{"$f":"IF($AE170<>\"\",INDEX(INDIRECT(\"'\"&$AD170&\"'!$B$7:$I$100\"),$AE170,AJ$2),\"\")","v":""},{"$f":"IF($AE170<>\"\",INDEX(INDIRECT(\"'\"&$AD170&\"'!$B$7:$I$100\"),$AE170,AK$2),\"\")","v":""},{"$f":"IF($AE170<>\"\",INDEX(INDIRECT(\"'\"&$AD170&\"'!$B$7:$I$100\"),$AE170,AL$2),\"\")","v":""},{"$f":"IF($AE170<>\"\",INDEX(INDIRECT(\"'\"&$AD170&\"'!$B$7:$I$100\"),$AE170,AM$2),\"\")","v":""},{"$f":"IF($AE170<>\"\",INDEX(INDIRECT(\"'\"&$AD170&\"'!$B$7:$I$100\"),$AE170,AN$2),\"\")","v":""},null,null,null,null,null,null,null,null,null,null,null,{"$f":"IFERROR( INDIRECT(\"'\"&$W170&\"'!$B$4\"), \"\")","v":""},"S168","",false,{"$error":"#VALUE!"},"S168",null,168,{"$f":"VLOOKUP(AC170,$Z$3:$AA208,2)","v":"S1"},""]
[null,"",{"$f":"IF($AE171<>\"\",INDEX(INDIRECT(\"'\"&$AD171&\"'!$B$7:$I$100\"),$AE171,AG$2),\"\")","v":""},{"$f":"IF($AE171<>\"\",INDEX(INDIRECT(\"'\"&$AD171&\"'!$B$7:$I$100\"),$AE171,AH$2),\"\")","v":""},{"$f":"IF($AE171<>\"\",INDEX(INDIRECT(\"'\"&$AD171&\"'!$B$7:$I$100\"),$AE171,AI$2),\"\")","v":""},{"$f":"IF($AE171<>\"\",INDEX(INDIRECT(\"'\"&$AD171&\"'!$B$7:$I$100\"),$AE171,AJ$2),\"\")","v":""},{"$f":"IF($AE171<>\"\",INDEX(INDIRECT(\"'\"&$AD171&\"'!$B$7:$I$100\"),$AE171,AK$2),\"\")","v":""},{"$f":"IF($AE171<>\"\",INDEX(INDIRECT(\"'\"&$AD171&\"'!$B$7:$I$100\"),$AE171,AL$2),\"\")","v":""},{"$f":"IF($AE171<>\"\",INDEX(INDIRECT(\"'\"&$AD171&\"'!$B$7:$I$100\"),$AE171,AM$2),\"\")","v":""},{"$f":"IF($AE171<>\"\",INDEX(INDIRECT(\"'\"&$AD171&\"'!$B$7:$I$100\"),$AE171,AN$2),\"\")","v":""},null,null,null,null,null,null,null,null,null,null,null,{"$f":"IFERROR( INDIRECT(\"'\"&$W171&\"'!$B$4\"), \"\")","v":""},"S169","",false,{"$error":"#VALUE!"},"S169",null,169,{"$f":"VLOOKUP(AC171,$Z$3:$AA209,2)","v":"S1"},""]
[null,"",{"$f":"IF($AE172<>\"\",INDEX(INDIRECT(\"'\"&$AD172&\"'!$B$7:$I$100\"),$AE172,AG$2),\"\")","v":""},{"$f":"IF($AE172<>\"\",INDEX(INDIRECT(\"'\"&$AD172&\"'!$B$7:$I$100\"),$AE172,AH$2),\"\")","v":""},{"$f":"IF($AE172<>\"\",INDEX(INDIRECT(\"'\"&$AD172&\"'!$B$7:$I$100\"),$AE172,AI$2),\"\")","v":""},{"$f":"IF($AE172<>\"\",INDEX(INDIRECT(\"'\"&$AD172&\"'!$B$7:$I$100\"),$AE172,AJ$2),\"\")","v":""},{"$f":"IF($AE172<>\"\",INDEX(INDIRECT(\"'\"&$AD172&\"'!$B$7:$I$100\"),$AE172,AK$2),\"\")","v":""},{"$f":"IF($AE172<>\"\",INDEX(INDIRECT(\"'\"&$AD172&\"'!$B$7:$I$100\"),$AE172,AL$2),\"\")","v":""},{"$f":"IF($AE172<>\"\",INDEX(INDIRECT(\"'\"&$AD172&\"'!$B$7:$I$100\"),$AE172,AM$2),\"\")","v":""},{"$f":"IF($AE172<>\"\",INDEX(INDIRECT(\"'\"&$AD172&\"'!$B$7:$I$100\"),$AE172,AN$2),\"\")","v":""},null,null,null,null,null,null,null,null,null,null,null,{"$f":"IFERROR( INDIRECT(\"'\"&$W172&\"'!$B$4\"), \"\")","v":""},"S170","",false,{"$error":"#VALUE!"},"S170",null,170,{"$f":"VLOOKUP(AC172,$Z$3:$AA210,2)","v":"S1"},""]
[null,"",{"$f":"IF($AE173<>\"\",INDEX(INDIRECT(\"'\"&$AD173&\"'!$B$7:$I$100\"),$AE173,AG$2),\"\")","v":""},{"$f":"IF($AE173<>\"\",INDEX(INDIRECT(\"'\"&$AD173&\"'!$B$7:$I$100\"),$AE173,AH$2),\"\")","v":""},{"$f":"IF($AE173<>\"\",INDEX(INDIRECT(\"'\"&$AD173&\"'!$B$7:$I$100\"),$AE173,AI$2),\"\")","v":""},{"$f":"IF($AE173<>\"\",INDEX(INDIRECT(\"'\"&$AD173&\"'!$B$7:$I$100\"),$AE173,AJ$2),\"\")","v":""},{"$f":"IF($AE173<>\"\",INDEX(INDIRECT(\"'\"&$AD173&\"'!$B$7:$I$100\"),$AE173,AK$2),\"\")","v":""},{"$f":"IF($AE173<>\"\",INDEX(INDIRECT(\"'\"&$AD173&\"'!$B$7:$I$100\"),$AE173,AL$2),\"\")","v":""},{"$f":"IF($AE173<>\"\",INDEX(INDIRECT(\"'\"&$AD173&\"'!$B$7:$I$100\"),$AE173,AM$2),\"\")","v":""},{"$f":"IF($AE173<>\"\",INDEX(INDIRECT(\"'\"&$AD173&\"'!$B$7:$I$100\"),$AE173,AN$2),\"\")","v":""},null,null,null,null,null,null,null,null,null,null,null,{"$f":"IFERROR( INDIRECT(\"'\"&$W173&\"'!$B$4\"), \"\")","v":""},"S171","",false,{"$error":"#VALUE!"},"S171",null,171,{"$f":"VLOOKUP(AC173,$Z$3:$AA211,2)","v":"S1"},""]
[null,"",{"$f":"IF($AE174<>\"\",INDEX(INDIRECT(\"'\"&$AD174&\"'!$B$7:$I$100\"),$AE174,AG$2),\"\")","v":""},{"$f":"IF($AE174<>\"\",INDEX(INDIRECT(\"'\"&$AD174&\"'!$B$7:$I$100\"),$AE174,AH$2),\"\")","v":""},{"$f":"IF($AE174<>\"\",INDEX(INDIRECT(\"'\"&$AD174&\"'!$B$7:$I$100\"),$AE174,AI$2),\"\")","v":""},{"$f":"IF($AE174<>\"\",INDEX(INDIRECT(\"'\"&$AD174&\"'!$B$7:$I$100\"),$AE174,AJ$2),\"\")","v":""},{"$f":"IF($AE174<>\"\",INDEX(INDIRECT(\"'\"&$AD174&\"'!$B$7:$I$100\"),$AE174,AK$2),\"\")","v":""},{"$f":"IF($AE174<>\"\",INDEX(INDIRECT(\"'\"&$AD174&\"'!$B$7:$I$100\"),$AE174,AL$2),\"\")","v":""},{"$f":"IF($AE174<>\"\",INDEX(INDIRECT(\"'\"&$AD174&\"'!$B$7:$I$100\"),$AE174,AM$2),\"\")","v":""},{"$f":"IF($AE174<>\"\",INDEX(INDIRECT(\"'\"&$AD174&\"'!$B$7:$I$100\"),$AE174,AN$2),\"\")","v":""},null,null,null,null,null,null,null,null,null,null,null,{"$f":"IFERROR( INDIRECT(\"'\"&$W174&\"'!$B$4\"), \"\")","v":""},"S172","",false,{"$error":"#VALUE!"},"S172",null,172,{"$f":"VLOOKUP(AC174,$Z$3:$AA212,2)","v":"S1"},""]
[null,"",{"$f":"IF($AE175<>\"\",INDEX(INDIRECT(\"'\"&$AD175&\"'!$B$7:$I$100\"),$AE175,AG$2),\"\")","v":""},{"$f":"IF($AE175<>\"\",INDEX(INDIRECT(\"'\"&$AD175&\"'!$B$7:$I$100\"),$AE175,AH$2),\"\")","v":""},{"$f":"IF($AE175<>\"\",INDEX(INDIRECT(\"'\"&$AD175&\"'!$B$7:$I$100\"),$AE175,AI$2),\"\")","v":""},{"$f":"IF($AE175<>\"\",INDEX(INDIRECT(\"'\"&$AD175&\"'!$B$7:$I$100\"),$AE175,AJ$2),\"\")","v":""},{"$f":"IF($AE175<>\"\",INDEX(INDIRECT(\"'\"&$AD175&\"'!$B$7:$I$100\"),$AE175,AK$2),\"\")","v":""},{"$f":"IF($AE175<>\"\",INDEX(INDIRECT(\"'\"&$AD175&\"'!$B$7:$I$100\"),$AE175,AL$2),\"\")","v":""},{"$f":"IF($AE175<>\"\",INDEX(INDIRECT(\"'\"&$AD175&\"'!$B$7:$I$100\"),$AE175,AM$2),\"\")","v":""},{"$f":"IF($AE175<>\"\",INDEX(INDIRECT(\"'\"&$AD175&\"'!$B$7:$I$100\"),$AE175,AN$2),\"\")","v":""},null,null,null,null,null,null,null,null,null,null,null,{"$f":"IFERROR( INDIRECT(\"'\"&$W175&\"'!$B$4\"), \"\")","v":""},"S173","",false,{"$error":"#VALUE!"},"S173",null,173,{"$f":"VLOOKUP(AC175,$Z$3:$AA213,2)","v":"S1"},""]
[null,"",{"$f":"IF($AE176<>\"\",INDEX(INDIRECT(\"'\"&$AD176&\"'!$B$7:$I$100\"),$AE176,AG$2),\"\")","v":""},{"$f":"IF($AE176<>\"\",INDEX(INDIRECT(\"'\"&$AD176&\"'!$B$7:$I$100\"),$AE176,AH$2),\"\")","v":""},{"$f":"IF($AE176<>\"\",INDEX(INDIRECT(\"'\"&$AD176&\"'!$B$7:$I$100\"),$AE176,AI$2),\"\")","v":""},{"$f":"IF($AE176<>\"\",INDEX(INDIRECT(\"'\"&$AD176&\"'!$B$7:$I$100\"),$AE176,AJ$2),\"\")","v":""},{"$f":"IF($AE176<>\"\",INDEX(INDIRECT(\"'\"&$AD176&\"'!$B$7:$I$100\"),$AE176,AK$2),\"\")","v":""},{"$f":"IF($AE176<>\"\",INDEX(INDIRECT(\"'\"&$AD176&\"'!$B$7:$I$100\"),$AE176,AL$2),\"\")","v":""},{"$f":"IF($AE176<>\"\",INDEX(INDIRECT(\"'\"&$AD176&\"'!$B$7:$I$100\"),$AE176,AM$2),\"\")","v":""},{"$f":"IF($AE176<>\"\",INDEX(INDIRECT(\"'\"&$AD176&\"'!$B$7:$I$100\"),$AE176,AN$2),\"\")","v":""},null,null,null,null,null,null,null,null,null,null,null,{"$f":"IFERROR( INDIRECT(\"'\"&$W176&\"'!$B$4\"), \"\")","v":""},"S174","",false,{"$error":"#VALUE!"},"S174",null,174,{"$f":"VLOOKUP(AC176,$Z$3:$AA214,2)","v":"S1"},""]
[null,"",{"$f":"IF($AE177<>\"\",INDEX(INDIRECT(\"'\"&$AD177&\"'!$B$7:$I$100\"),$AE177,AG$2),\"\")","v":""},{"$f":"IF($AE177<>\"\",INDEX(INDIRECT(\"'\"&$AD177&\"'!$B$7:$I$100\"),$AE177,AH$2),\"\")","v":""},{"$f":"IF($AE177<>\"\",INDEX(INDIRECT(\"'\"&$AD177&\"'!$B$7:$I$100\"),$AE177,AI$2),\"\")","v":""},{"$f":"IF($AE177<>\"\",INDEX(INDIRECT(\"'\"&$AD177&\"'!$B$7:$I$100\"),$AE177,AJ$2),\"\")","v":""},{"$f":"IF($AE177<>\"\",INDEX(INDIRECT(\"'\"&$AD177&\"'!$B$7:$I$100\"),$AE177,AK$2),\"\")","v":""},{"$f":"IF($AE177<>\"\",INDEX(INDIRECT(\"'\"&$AD177&\"'!$B$7:$I$100\"),$AE177,AL$2),\"\")","v":""},{"$f":"IF($AE177<>\"\",INDEX(INDIRECT(\"'\"&$AD177&\"'!$B$7:$I$100\"),$AE177,AM$2),\"\")","v":""},{"$f":"IF($AE177<>\"\",INDEX(INDIRECT(\"'\"&$AD177&\"'!$B$7:$I$100\"),$AE177,AN$2),\"\")","v":""},null,null,null,null,null,null,null,null,null,null,null,{"$f":"IFERROR( INDIRECT(\"'\"&$W177&\"'!$B$4\"), \"\")","v":""},"S175","",false,{"$error":"#VALUE!"},"S175",null,175,{"$f":"VLOOKUP(AC177,$Z$3:$AA215,2)","v":"S1"},""]
[null,"",{"$f":"IF($AE178<>\"\",INDEX(INDIRECT(\"'\"&$AD178&\"'!$B$7:$I$100\"),$AE178,AG$2),\"\")","v":""},{"$f":"IF($AE178<>\"\",INDEX(INDIRECT(\"'\"&$AD178&\"'!$B$7:$I$100\"),$AE178,AH$2),\"\")","v":""},{"$f":"IF($AE178<>\"\",INDEX(INDIRECT(\"'\"&$AD178&\"'!$B$7:$I$100\"),$AE178,AI$2),\"\")","v":""},{"$f":"IF($AE178<>\"\",INDEX(INDIRECT(\"'\"&$AD178&\"'!$B$7:$I$100\"),$AE178,AJ$2),\"\")","v":""},{"$f":"IF($AE178<>\"\",INDEX(INDIRECT(\"'\"&$AD178&\"'!$B$7:$I$100\"),$AE178,AK$2),\"\")","v":""},{"$f":"IF($AE178<>\"\",INDEX(INDIRECT(\"'\"&$AD178&\"'!$B$7:$I$100\"),$AE178,AL$2),\"\")","v":""},{"$f":"IF($AE178<>\"\",INDEX(INDIRECT(\"'\"&$AD178&\"'!$B$7:$I$100\"),$AE178,AM$2),\"\")","v":""},{"$f":"IF($AE178<>\"\",INDEX(INDIRECT(\"'\"&$AD178&\"'!$B$7:$I$100\"),$AE178,AN$2),\"\")","v":""},null,null,null,null,null,null,null,null,null,null,null,{"$f":"IFERROR( INDIRECT(\"'\"&$W178&\"'!$B$4\"), \"\")","v":""},"S176","",false,{"$error":"#VALUE!"},"S176",null,176,{"$f":"VLOOKUP(AC178,$Z$3:$AA216,2)","v":"S1"},""]
[null,"",{"$f":"IF($AE179<>\"\",INDEX(INDIRECT(\"'\"&$AD179&\"'!$B$7:$I$100\"),$AE179,AG$2),\"\")","v":""},{"$f":"IF($AE179<>\"\",INDEX(INDIRECT(\"'\"&$AD179&\"'!$B$7:$I$100\"),$AE179,AH$2),\"\")","v":""},{"$f":"IF($AE179<>\"\",INDEX(INDIRECT(\"'\"&$AD179&\"'!$B$7:$I$100\"),$AE179,AI$2),\"\")","v":""},{"$f":"IF($AE179<>\"\",INDEX(INDIRECT(\"'\"&$AD179&\"'!$B$7:$I$100\"),$AE179,AJ$2),\"\")","v":""},{"$f":"IF($AE179<>\"\",INDEX(INDIRECT(\"'\"&$AD179&\"'!$B$7:$I$100\"),$AE179,AK$2),\"\")","v":""},{"$f":"IF($AE179<>\"\",INDEX(INDIRECT(\"'\"&$AD179&\"'!$B$7:$I$100\"),$AE179,AL$2),\"\")","v":""},{"$f":"IF($AE179<>\"\",INDEX(INDIRECT(\"'\"&$AD179&\"'!$B$7:$I$100\"),$AE179,AM$2),\"\")","v":""},{"$f":"IF($AE179<>\"\",INDEX(INDIRECT(\"'\"&$AD179&\"'!$B$7:$I$100\"),$AE179,AN$2),\"\")","v":""},null,null,null,null,null,null,null,null,null,null,null,{"$f":"IFERROR( INDIRECT(\"'\"&$W179&\"'!$B$4\"), \"\")","v":""},"S177","",false,{"$error":"#VALUE!"},"S177",null,177,{"$f":"VLOOKUP(AC179,$Z$3:$AA217,2)","v":"S1"},""]
[null,"",{"$f":"IF($AE180<>\"\",INDEX(INDIRECT(\"'\"&$AD180&\"'!$B$7:$I$100\"),$AE180,AG$2),\"\")","v":""},{"$f":"IF($AE180<>\"\",INDEX(INDIRECT(\"'\"&$AD180&\"'!$B$7:$I$100\"),$AE180,AH$2),\"\")","v":""},{"$f":"IF($AE180<>\"\",INDEX(INDIRECT(\"'\"&$AD180&\"'!$B$7:$I$100\"),$AE180,AI$2),\"\")","v":""},{"$f":"IF($AE180<>\"\",INDEX(INDIRECT(\"'\"&$AD180&\"'!$B$7:$I$100\"),$AE180,AJ$2),\"\")","v":""},{"$f":"IF($AE180<>\"\",INDEX(INDIRECT(\"'\"&$AD180&\"'!$B$7:$I$100\"),$AE180,AK$2),\"\")","v":""},{"$f":"IF($AE180<>\"\",INDEX(INDIRECT(\"'\"&$AD180&\"'!$B$7:$I$100\"),$AE180,AL$2),\"\")","v":""},{"$f":"IF($AE180<>\"\",INDEX(INDIRECT(\"'\"&$AD180&\"'!$B$7:$I$100\"),$AE180,AM$2),\"\")","v":""},{"$f":"IF($AE180<>\"\",INDEX(INDIRECT(\"'\"&$AD180&\"'!$B$7:$I$100\"),$AE180,AN$2),\"\")","v":""},null,null,null,null,null,null,null,null,null,null,null,{"$f":"IFERROR( INDIRECT(\"'\"&$W180&\"'!$B$4\"), \"\")","v":""},"S178","",false,{"$error":"#VALUE!"},"S178",null,178,{"$f":"VLOOKUP(AC180,$Z$3:$AA218,2)","v":"S1"},""]
[null,"",{"$f":"IF($AE181<>\"\",INDEX(INDIRECT(\"'\"&$AD181&\"'!$B$7:$I$100\"),$AE181,AG$2),\"\")","v":""},{"$f":"IF($AE181<>\"\",INDEX(INDIRECT(\"'\"&$AD181&\"'!$B$7:$I$100\"),$AE181,AH$2),\"\")","v":""},{"$f":"IF($AE181<>\"\",INDEX(INDIRECT(\"'\"&$AD181&\"'!$B$7:$I$100\"),$AE181,AI$2),\"\")","v":""},{"$f":"IF($AE181<>\"\",INDEX(INDIRECT(\"'\"&$AD181&\"'!$B$7:$I$100\"),$AE181,AJ$2),\"\")","v":""},{"$f":"IF($AE181<>\"\",INDEX(INDIRECT(\"'\"&$AD181&\"'!$B$7:$I$100\"),$AE181,AK$2),\"\")","v":""},{"$f":"IF($AE181<>\"\",INDEX(INDIRECT(\"'\"&$AD181&\"'!$B$7:$I$100\"),$AE181,AL$2),\"\")","v":""},{"$f":"IF($AE181<>\"\",INDEX(INDIRECT(\"'\"&$AD181&\"'!$B$7:$I$100\"),$AE181,AM$2),\"\")","v":""},{"$f":"IF($AE181<>\"\",INDEX(INDIRECT(\"'\"&$AD181&\"'!$B$7:$I$100\"),$AE181,AN$2),\"\")","v":""},null,null,null,null,null,null,null,null,null,null,null,{"$f":"IFERROR( INDIRECT(\"'\"&$W181&\"'!$B$4\"), \"\")","v":""},"S179","",false,{"$error":"#VALUE!"},"S179",null,179,{"$f":"VLOOKUP(AC181,$Z$3:$AA219,2)","v":"S1"},""]
[null,"",{"$f":"IF($AE182<>\"\",INDEX(INDIRECT(\"'\"&$AD182&\"'!$B$7:$I$100\"),$AE182,AG$2),\"\")","v":""},{"$f":"IF($AE182<>\"\",INDEX(INDIRECT(\"'\"&$AD182&\"'!$B$7:$I$100\"),$AE182,AH$2),\"\")","v":""},{"$f":"IF($AE182<>\"\",INDEX(INDIRECT(\"'\"&$AD182&\"'!$B$7:$I$100\"),$AE182,AI$2),\"\")","v":""},{"$f":"IF($AE182<>\"\",INDEX(INDIRECT(\"'\"&$AD182&\"'!$B$7:$I$100\"),$AE182,AJ$2),\"\")","v":""},{"$f":"IF($AE182<>\"\",INDEX(INDIRECT(\"'\"&$AD182&\"'!$B$7:$I$100\"),$AE182,AK$2),\"\")","v":""},{"$f":"IF($AE182<>\"\",INDEX(INDIRECT(\"'\"&$AD182&\"'!$B$7:$I$100\"),$AE182,AL$2),\"\")","v":""},{"$f":"IF($AE182<>\"\",INDEX(INDIRECT(\"'\"&$AD182&\"'!$B$7:$I$100\"),$AE182,AM$2),\"\")","v":""},{"$f":"IF($AE182<>\"\",INDEX(INDIRECT(\"'\"&$AD182&\"'!$B$7:$I$100\"),$AE182,AN$2),\"\")","v":""},null,null,null,null,null,null,null,null,null,null,null,{"$f":"IFERROR( INDIRECT(\"'\"&$W182&\"'!$B$4\"), \"\")","v":""},"S180","",false,{"$error":"#VALUE!"},"S180",null,180,{"$f":"VLOOKUP(AC182,$Z$3:$AA220,2)","v":"S1"},""]
[null,"",{"$f":"IF($AE183<>\"\",INDEX(INDIRECT(\"'\"&$AD183&\"'!$B$7:$I$100\"),$AE183,AG$2),\"\")","v":""},{"$f":"IF($AE183<>\"\",INDEX(INDIRECT(\"'\"&$AD183&\"'!$B$7:$I$100\"),$AE183,AH$2),\"\")","v":""},{"$f":"IF($AE183<>\"\",INDEX(INDIRECT(\"'\"&$AD183&\"'!$B$7:$I$100\"),$AE183,AI$2),\"\")","v":""},{"$f":"IF($AE183<>\"\",INDEX(INDIRECT(\"'\"&$AD183&\"'!$B$7:$I$100\"),$AE183,AJ$2),\"\")","v":""},{"$f":"IF($AE183<>\"\",INDEX(INDIRECT(\"'\"&$AD183&\"'!$B$7:$I$100\"),$AE183,AK$2),\"\")","v":""},{"$f":"IF($AE183<>\"\",INDEX(INDIRECT(\"'\"&$AD183&\"'!$B$7:$I$100\"),$AE183,AL$2),\"\")","v":""},{"$f":"IF($AE183<>\"\",INDEX(INDIRECT(\"'\"&$AD183&\"'!$B$7:$I$100\"),$AE183,AM$2),\"\")","v":""},{"$f":"IF($AE183<>\"\",INDEX(INDIRECT(\"'\"&$AD183&\"'!$B$7:$I$100\"),$AE183,AN$2),\"\")","v":""},null,null,null,null,null,null,null,null,null,null,null,{"$f":"IFERROR( INDIRECT(\"'\"&$W183&\"'!$B$4\"), \"\")","v":""},"S181","",false,{"$error":"#VALUE!"},"S181",null,181,{"$f":"VLOOKUP(AC183,$Z$3:$AA221,2)","v":"S1"},""]
[null,"",{"$f":"IF($AE184<>\"\",INDEX(INDIRECT(\"'\"&$AD184&\"'!$B$7:$I$100\"),$AE184,AG$2),\"\")","v":""},{"$f":"IF($AE184<>\"\",INDEX(INDIRECT(\"'\"&$AD184&\"'!$B$7:$I$100\"),$AE184,AH$2),\"\")","v":""},{"$f":"IF($AE184<>\"\",INDEX(INDIRECT(\"'\"&$AD184&\"'!$B$7:$I$100\"),$AE184,AI$2),\"\")","v":""},{"$f":"IF($AE184<>\"\",INDEX(INDIRECT(\"'\"&$AD184&\"'!$B$7:$I$100\"),$AE184,AJ$2),\"\")","v":""},{"$f":"IF($AE184<>\"\",INDEX(INDIRECT(\"'\"&$AD184&\"'!$B$7:$I$100\"),$AE184,AK$2),\"\")","v":""},{"$f":"IF($AE184<>\"\",INDEX(INDIRECT(\"'\"&$AD184&\"'!$B$7:$I$100\"),$AE184,AL$2),\"\")","v":""},{"$f":"IF($AE184<>\"\",INDEX(INDIRECT(\"'\"&$AD184&\"'!$B$7:$I$100\"),$AE184,AM$2),\"\")","v":""},{"$f":"IF($AE184<>\"\",INDEX(INDIRECT(\"'\"&$AD184&\"'!$B$7:$I$100\"),$AE184,AN$2),\"\")","v":""},null,null,null,null,null,null,null,null,null,null,null,{"$f":"IFERROR( INDIRECT(\"'\"&$W184&\"'!$B$4\"), \"\")","v":""},"S182","",false,{"$error":"#VALUE!"},"S182",null,182,{"$f":"VLOOKUP(AC184,$Z$3:$AA222,2)","v":"S1"},""]
[null,{"$f":"IF($AE185<>\"\",VLOOKUP(AD185,$W$3:$X$42,2,FALSE),\"\")","v":""},{"$f":"IF($AE185<>\"\",INDEX(INDIRECT(\"'\"&$AD185&\"'!$B$7:$I$100\"),$AE185,AG$2),\"\")","v":""},{"$f":"IF($AE185<>\"\",INDEX(INDIRECT(\"'\"&$AD185&\"'!$B$7:$I$100\"),$AE185,AH$2),\"\")","v":""},{"$f":"IF($AE185<>\"\",INDEX(INDIRECT(\"'\"&$AD185&\"'!$B$7:$I$100\"),$AE185,AI$2),\"\")","v":""},{"$f":"IF($AE185<>\"\",INDEX(INDIRECT(\"'\"&$AD185&\"'!$B$7:$I$100\"),$AE185,AJ$2),\"\")","v":""},{"$f":"IF($AE185<>\"\",INDEX(INDIRECT(\"'\"&$AD185&\"'!$B$7:$I$100\"),$AE185,AK$2),\"\")","v":""},{"$f":"IF($AE185<>\"\",INDEX(INDIRECT(\"'\"&$AD185&\"'!$B$7:$I$100\"),$AE185,AL$2),\"\")","v":""},{"$f":"IF($AE185<>\"\",INDEX(INDIRECT(\"'\"&$AD185&\"'!$B$7:$I$100\"),$AE185,AM$2),\"\")","v":""},{"$f":"IF($AE185<>\"\",INDEX(INDIRECT(\"'\"&$AD185&\"'!$B$7:$I$100\"),$AE185,AN$2),\"\")","v":""},null,null,null,null,null,null,null,null,null,null,null,{"$f":"IFERROR( INDIRECT(\"'\"&$W185&\"'!$B$4\"), \"\")","v":""},"S183","",false,{"$error":"#VALUE!"},"S183",null,183,{"$f":"VLOOKUP(AC185,$Z$3:$AA223,2)","v":"S1"},""]
[null,"",{"$f":"IF($AE186<>\"\",INDEX(INDIRECT(\"'\"&$AD186&\"'!$B$7:$I$100\"),$AE186,AG$2),\"\")","v":""},{"$f":"IF($AE186<>\"\",INDEX(INDIRECT(\"'\"&$AD186&\"'!$B$7:$I$100\"),$AE186,AH$2),\"\")","v":""},{"$f":"IF($AE186<>\"\",INDEX(INDIRECT(\"'\"&$AD186&\"'!$B$7:$I$100\"),$AE186,AI$2),\"\")","v":""},{"$f":"IF($AE186<>\"\",INDEX(INDIRECT(\"'\"&$AD186&\"'!$B$7:$I$100\"),$AE186,AJ$2),\"\")","v":""},{"$f":"IF($AE186<>\"\",INDEX(INDIRECT(\"'\"&$AD186&\"'!$B$7:$I$100\"),$AE186,AK$2),\"\")","v":""},{"$f":"IF($AE186<>\"\",INDEX(INDIRECT(\"'\"&$AD186&\"'!$B$7:$I$100\"),$AE186,AL$2),\"\")","v":""},{"$f":"IF($AE186<>\"\",INDEX(INDIRECT(\"'\"&$AD186&\"'!$B$7:$I$100\"),$AE186,AM$2),\"\")","v":""},{"$f":"IF($AE186<>\"\",INDEX(INDIRECT(\"'\"&$AD186&\"'!$B$7:$I$100\"),$AE186,AN$2),\"\")","v":""},null,null,null,null,null,null,null,null,null,null,null,{"$f":"IFERROR( INDIRECT(\"'\"&$W186&\"'!$B$4\"), \"\")","v":""},"S184",{"$f":"V186","v":""},false,{"$f":"AB185+Z185","v":{"$error":"#VALUE!"}},"S184",null,184,{"$f":"VLOOKUP(AC186,$Z$3:$AA224,2)","v":"S1"},{"$f":"IF(VLOOKUP(AD186,$W$3:$AD$102,3,FALSE)=TRUE,IF(AD186=AD185,AE185+1,1),\"\")","v":""}]
[null,"",{"$f":"IF($AE187<>\"\",INDEX(INDIRECT(\"'\"&$AD187&\"'!$B$7:$I$100\"),$AE187,AG$2),\"\")","v":""},{"$f":"IF($AE187<>\"\",INDEX(INDIRECT(\"'\"&$AD187&\"'!$B$7:$I$100\"),$AE187,AH$2),\"\")","v":""},{"$f":"IF($AE187<>\"\",INDEX(INDIRECT(\"'\"&$AD187&\"'!$B$7:$I$100\"),$AE187,AI$2),\"\")","v":""},{"$f":"IF($AE187<>\"\",INDEX(INDIRECT(\"'\"&$AD187&\"'!$B$7:$I$100\"),$AE187,AJ$2),\"\")","v":""},{"$f":"IF($AE187<>\"\",INDEX(INDIRECT(\"'\"&$AD187&\"'!$B$7:$I$100\"),$AE187,AK$2),\"\")","v":""},{"$f":"IF($AE187<>\"\",INDEX(INDIRECT(\"'\"&$AD187&\"'!$B$7:$I$100\"),$AE187,AL$2),\"\")","v":""},{"$f":"IF($AE187<>\"\",INDEX(INDIRECT(\"'\"&$AD187&\"'!$B$7:$I$100\"),$AE187,AM$2),\"\")","v":""},{"$f":"IF($AE187<>\"\",INDEX(INDIRECT(\"'\"&$AD187&\"'!$B$7:$I$100\"),$AE187,AN$2),\"\")","v":""},null,null,null,null,null,null,null,null,null,null,null,{"$f":"IFERROR( INDIRECT(\"'\"&$W187&\"'!$B$4\"), \"\")","v":""},"S185","",false,{"$error":"#VALUE!"},"S185",null,185,{"$f":"VLOOKUP(AC187,$Z$3:$AA225,2)","v":"S1"},""]
[null,"",{"$f":"IF($AE188<>\"\",INDEX(INDIRECT(\"'\"&$AD188&\"'!$B$7:$I$100\"),$AE188,AG$2),\"\")","v":""},{"$f":"IF($AE188<>\"\",INDEX(INDIRECT(\"'\"&$AD188&\"'!$B$7:$I$100\"),$AE188,AH$2),\"\")","v":""},{"$f":"IF($AE188<>\"\",INDEX(INDIRECT(\"'\"&$AD188&\"'!$B$7:$I$100\"),$AE188,AI$2),\"\")","v":""},{"$f":"IF($AE188<>\"\",INDEX(INDIRECT(\"'\"&$AD188&\"'!$B$7:$I$100\"),$AE188,AJ$2),\"\")","v":""},{"$f":"IF($AE188<>\"\",INDEX(INDIRECT(\"'\"&$AD188&\"'!$B$7:$I$100\"),$AE188,AK$2),\"\")","v":""},{"$f":"IF($AE188<>\"\",INDEX(INDIRECT(\"'\"&$AD188&\"'!$B$7:$I$100\"),$AE188,AL$2),\"\")","v":""},{"$f":"IF($AE188<>\"\",INDEX(INDIRECT(\"'\"&$AD188&\"'!$B$7:$I$100\"),$AE188,AM$2),\"\")","v":""},{"$f":"IF($AE188<>\"\",INDEX(INDIRECT(\"'\"&$AD188&\"'!$B$7:$I$100\"),$AE188,AN$2),\"\")","v":""},null,null,null,null,null,null,null,null,null,null,null,{"$f":"IFERROR( INDIRECT(\"'\"&$W188&\"'!$B$4\"), \"\")","v":""},"S186","",false,{"$error":"#VALUE!"},"S186",null,186,{"$f":"VLOOKUP(AC188,$Z$3:$AA226,2)","v":"S1"},""]
[null,"",{"$f":"IF($AE189<>\"\",INDEX(INDIRECT(\"'\"&$AD189&\"'!$B$7:$I$100\"),$AE189,AG$2),\"\")","v":""},{"$f":"IF($AE189<>\"\",INDEX(INDIRECT(\"'\"&$AD189&\"'!$B$7:$I$100\"),$AE189,AH$2),\"\")","v":""},{"$f":"IF($AE189<>\"\",INDEX(INDIRECT(\"'\"&$AD189&\"'!$B$7:$I$100\"),$AE189,AI$2),\"\")","v":""},{"$f":"IF($AE189<>\"\",INDEX(INDIRECT(\"'\"&$AD189&\"'!$B$7:$I$100\"),$AE189,AJ$2),\"\")","v":""},{"$f":"IF($AE189<>\"\",INDEX(INDIRECT(\"'\"&$AD189&\"'!$B$7:$I$100\"),$AE189,AK$2),\"\")","v":""},{"$f":"IF($AE189<>\"\",INDEX(INDIRECT(\"'\"&$AD189&\"'!$B$7:$I$100\"),$AE189,AL$2),\"\")","v":""},{"$f":"IF($AE189<>\"\",INDEX(INDIRECT(\"'\"&$AD189&\"'!$B$7:$I$100\"),$AE189,AM$2),\"\")","v":""},{"$f":"IF($AE189<>\"\",INDEX(INDIRECT(\"'\"&$AD189&\"'!$B$7:$I$100\"),$AE189,AN$2),\"\")","v":""},null,null,null,null,null,null,null,null,null,null,null,{"$f":"IFERROR( INDIRECT(\"'\"&$W189&\"'!$B$4\"), \"\")","v":""},"S187","",false,{"$error":"#VALUE!"},"S187",null,187,{"$f":"VLOOKUP(AC189,$Z$3:$AA227,2)","v":"S1"},""]
[null,"",{"$f":"IF($AE190<>\"\",INDEX(INDIRECT(\"'\"&$AD190&\"'!$B$7:$I$100\"),$AE190,AG$2),\"\")","v":""},{"$f":"IF($AE190<>\"\",INDEX(INDIRECT(\"'\"&$AD190&\"'!$B$7:$I$100\"),$AE190,AH$2),\"\")","v":""},{"$f":"IF($AE190<>\"\",INDEX(INDIRECT(\"'\"&$AD190&\"'!$B$7:$I$100\"),$AE190,AI$2),\"\")","v":""},{"$f":"IF($AE190<>\"\",INDEX(INDIRECT(\"'\"&$AD190&\"'!$B$7:$I$100\"),$AE190,AJ$2),\"\")","v":""},{"$f":"IF($AE190<>\"\",INDEX(INDIRECT(\"'\"&$AD190&\"'!$B$7:$I$100\"),$AE190,AK$2),\"\")","v":""},{"$f":"IF($AE190<>\"\",INDEX(INDIRECT(\"'\"&$AD190&\"'!$B$7:$I$100\"),$AE190,AL$2),\"\")","v":""},{"$f":"IF($AE190<>\"\",INDEX(INDIRECT(\"'\"&$AD190&\"'!$B$7:$I$100\"),$AE190,AM$2),\"\")","v":""},{"$f":"IF($AE190<>\"\",INDEX(INDIRECT(\"'\"&$AD190&\"'!$B$7:$I$100\"),$AE190,AN$2),\"\")","v":""},null,null,null,null,null,null,null,null,null,null,null,{"$f":"IFERROR( INDIRECT(\"'\"&$W190&\"'!$B$4\"), \"\")","v":""},"S188","",false,{"$error":"#VALUE!"},"S188",null,188,{"$f":"VLOOKUP(AC190,$Z$3:$AA228,2)","v":"S1"},""]
[null,"",{"$f":"IF($AE191<>\"\",INDEX(INDIRECT(\"'\"&$AD191&\"'!$B$7:$I$100\"),$AE191,AG$2),\"\")","v":""},{"$f":"IF($AE191<>\"\",INDEX(INDIRECT(\"'\"&$AD191&\"'!$B$7:$I$100\"),$AE191,AH$2),\"\")","v":""},{"$f":"IF($AE191<>\"\",INDEX(INDIRECT(\"'\"&$AD191&\"'!$B$7:$I$100\"),$AE191,AI$2),\"\")","v":""},{"$f":"IF($AE191<>\"\",INDEX(INDIRECT(\"'\"&$AD191&\"'!$B$7:$I$100\"),$AE191,AJ$2),\"\")","v":""},{"$f":"IF($AE191<>\"\",INDEX(INDIRECT(\"'\"&$AD191&\"'!$B$7:$I$100\"),$AE191,AK$2),\"\")","v":""},{"$f":"IF($AE191<>\"\",INDEX(INDIRECT(\"'\"&$AD191&\"'!$B$7:$I$100\"),$AE191,AL$2),\"\")","v":""},{"$f":"IF($AE191<>\"\",INDEX(INDIRECT(\"'\"&$AD191&\"'!$B$7:$I$100\"),$AE191,AM$2),\"\")","v":""},{"$f":"IF($AE191<>\"\",INDEX(INDIRECT(\"'\"&$AD191&\"'!$B$7:$I$100\"),$AE191,AN$2),\"\")","v":""},null,null,null,null,null,null,null,null,null,null,null,{"$f":"IFERROR( INDIRECT(\"'\"&$W191&\"'!$B$4\"), \"\")","v":""},"S189","",false,{"$error":"#VALUE!"},"S189",null,189,{"$f":"VLOOKUP(AC191,$Z$3:$AA229,2)","v":"S1"},""]
[null,"",{"$f":"IF($AE192<>\"\",INDEX(INDIRECT(\"'\"&$AD192&\"'!$B$7:$I$100\"),$AE192,AG$2),\"\")","v":""},{"$f":"IF($AE192<>\"\",INDEX(INDIRECT(\"'\"&$AD192&\"'!$B$7:$I$100\"),$AE192,AH$2),\"\")","v":""},{"$f":"IF($AE192<>\"\",INDEX(INDIRECT(\"'\"&$AD192&\"'!$B$7:$I$100\"),$AE192,AI$2),\"\")","v":""},{"$f":"IF($AE192<>\"\",INDEX(INDIRECT(\"'\"&$AD192&\"'!$B$7:$I$100\"),$AE192,AJ$2),\"\")","v":""},{"$f":"IF($AE192<>\"\",INDEX(INDIRECT(\"'\"&$AD192&\"'!$B$7:$I$100\"),$AE192,AK$2),\"\")","v":""},{"$f":"IF($AE192<>\"\",INDEX(INDIRECT(\"'\"&$AD192&\"'!$B$7:$I$100\"),$AE192,AL$2),\"\")","v":""},{"$f":"IF($AE192<>\"\",INDEX(INDIRECT(\"'\"&$AD192&\"'!$B$7:$I$100\"),$AE192,AM$2),\"\")","v":""},{"$f":"IF($AE192<>\"\",INDEX(INDIRECT(\"'\"&$AD192&\"'!$B$7:$I$100\"),$AE192,AN$2),\"\")","v":""},null,null,null,null,null,null,null,null,null,null,null,{"$f":"IFERROR( INDIRECT(\"'\"&$W192&\"'!$B$4\"), \"\")","v":""},"S190","",false,{"$error":"#VALUE!"},"S190",null,190,{"$f":"VLOOKUP(AC192,$Z$3:$AA230,2)","v":"S1"},""]
[null,"",{"$f":"IF($AE193<>\"\",INDEX(INDIRECT(\"'\"&$AD193&\"'!$B$7:$I$100\"),$AE193,AG$2),\"\")","v":""},{"$f":"IF($AE193<>\"\",INDEX(INDIRECT(\"'\"&$AD193&\"'!$B$7:$I$100\"),$AE193,AH$2),\"\")","v":""},{"$f":"IF($AE193<>\"\",INDEX(INDIRECT(\"'\"&$AD193&\"'!$B$7:$I$100\"),$AE193,AI$2),\"\")","v":""},{"$f":"IF($AE193<>\"\",INDEX(INDIRECT(\"'\"&$AD193&\"'!$B$7:$I$100\"),$AE193,AJ$2),\"\")","v":""},{"$f":"IF($AE193<>\"\",INDEX(INDIRECT(\"'\"&$AD193&\"'!$B$7:$I$100\"),$AE193,AK$2),\"\")","v":""},{"$f":"IF($AE193<>\"\",INDEX(INDIRECT(\"'\"&$AD193&\"'!$B$7:$I$100\"),$AE193,AL$2),\"\")","v":""},{"$f":"IF($AE193<>\"\",INDEX(INDIRECT(\"'\"&$AD193&\"'!$B$7:$I$100\"),$AE193,AM$2),\"\")","v":""},{"$f":"IF($AE193<>\"\",INDEX(INDIRECT(\"'\"&$AD193&\"'!$B$7:$I$100\"),$AE193,AN$2),\"\")","v":""},null,null,null,null,null,null,null,null,null,null,null,{"$f":"IFERROR( INDIRECT(\"'\"&$W193&\"'!$B$4\"), \"\")","v":""},"S191","",false,{"$error":"#VALUE!"},"S191",null,191,{"$f":"VLOOKUP(AC193,$Z$3:$AA231,2)","v":"S1"},""]
[null,"",{"$f":"IF($AE194<>\"\",INDEX(INDIRECT(\"'\"&$AD194&\"'!$B$7:$I$100\"),$AE194,AG$2),\"\")","v":""},{"$f":"IF($AE194<>\"\",INDEX(INDIRECT(\"'\"&$AD194&\"'!$B$7:$I$100\"),$AE194,AH$2),\"\")","v":""},{"$f":"IF($AE194<>\"\",INDEX(INDIRECT(\"'\"&$AD194&\"'!$B$7:$I$100\"),$AE194,AI$2),\"\")","v":""},{"$f":"IF($AE194<>\"\",INDEX(INDIRECT(\"'\"&$AD194&\"'!$B$7:$I$100\"),$AE194,AJ$2),\"\")","v":""},{"$f":"IF($AE194<>\"\",INDEX(INDIRECT(\"'\"&$AD194&\"'!$B$7:$I$100\"),$AE194,AK$2),\"\")","v":""},{"$f":"IF($AE194<>\"\",INDEX(INDIRECT(\"'\"&$AD194&\"'!$B$7:$I$100\"),$AE194,AL$2),\"\")","v":""},{"$f":"IF($AE194<>\"\",INDEX(INDIRECT(\"'\"&$AD194&\"'!$B$7:$I$100\"),$AE194,AM$2),\"\")","v":""},{"$f":"IF($AE194<>\"\",INDEX(INDIRECT(\"'\"&$AD194&\"'!$B$7:$I$100\"),$AE194,AN$2),\"\")","v":""},null,null,null,null,null,null,null,null,null,null,null,{"$f":"IFERROR( INDIRECT(\"'\"&$W194&\"'!$B$4\"), \"\")","v":""},"S192","",false,{"$error":"#VALUE!"},"S192",null,192,{"$f":"VLOOKUP(AC194,$Z$3:$AA232,2)","v":"S1"},""]
[null,"",{"$f":"IF($AE195<>\"\",INDEX(INDIRECT(\"'\"&$AD195&\"'!$B$7:$I$100\"),$AE195,AG$2),\"\")","v":""},{"$f":"IF($AE195<>\"\",INDEX(INDIRECT(\"'\"&$AD195&\"'!$B$7:$I$100\"),$AE195,AH$2),\"\")","v":""},{"$f":"IF($AE195<>\"\",INDEX(INDIRECT(\"'\"&$AD195&\"'!$B$7:$I$100\"),$AE195,AI$2),\"\")","v":""},{"$f":"IF($AE195<>\"\",INDEX(INDIRECT(\"'\"&$AD195&\"'!$B$7:$I$100\"),$AE195,AJ$2),\"\")","v":""},{"$f":"IF($AE195<>\"\",INDEX(INDIRECT(\"'\"&$AD195&\"'!$B$7:$I$100\"),$AE195,AK$2),\"\")","v":""},{"$f":"IF($AE195<>\"\",INDEX(INDIRECT(\"'\"&$AD195&\"'!$B$7:$I$100\"),$AE195,AL$2),\"\")","v":""},{"$f":"IF($AE195<>\"\",INDEX(INDIRECT(\"'\"&$AD195&\"'!$B$7:$I$100\"),$AE195,AM$2),\"\")","v":""},{"$f":"IF($AE195<>\"\",INDEX(INDIRECT(\"'\"&$AD195&\"'!$B$7:$I$100\"),$AE195,AN$2),\"\")","v":""},null,null,null,null,null,null,null,null,null,null,null,{"$f":"IFERROR( INDIRECT(\"'\"&$W195&\"'!$B$4\"), \"\")","v":""},"S193","",false,{"$error":"#VALUE!"},"S193",null,193,{"$f":"VLOOKUP(AC195,$Z$3:$AA233,2)","v":"S1"},""]
[null,"",{"$f":"IF($AE196<>\"\",INDEX(INDIRECT(\"'\"&$AD196&\"'!$B$7:$I$100\"),$AE196,AG$2),\"\")","v":""},{"$f":"IF($AE196<>\"\",INDEX(INDIRECT(\"'\"&$AD196&\"'!$B$7:$I$100\"),$AE196,AH$2),\"\")","v":""},{"$f":"IF($AE196<>\"\",INDEX(INDIRECT(\"'\"&$AD196&\"'!$B$7:$I$100\"),$AE196,AI$2),\"\")","v":""},{"$f":"IF($AE196<>\"\",INDEX(INDIRECT(\"'\"&$AD196&\"'!$B$7:$I$100\"),$AE196,AJ$2),\"\")","v":""},{"$f":"IF($AE196<>\"\",INDEX(INDIRECT(\"'\"&$AD196&\"'!$B$7:$I$100\"),$AE196,AK$2),\"\")","v":""},{"$f":"IF($AE196<>\"\",INDEX(INDIRECT(\"'\"&$AD196&\"'!$B$7:$I$100\"),$AE196,AL$2),\"\")","v":""},{"$f":"IF($AE196<>\"\",INDEX(INDIRECT(\"'\"&$AD196&\"'!$B$7:$I$100\"),$AE196,AM$2),\"\")","v":""},{"$f":"IF($AE196<>\"\",INDEX(INDIRECT(\"'\"&$AD196&\"'!$B$7:$I$100\"),$AE196,AN$2),\"\")","v":""},null,null,null,null,null,null,null,null,null,null,null,{"$f":"IFERROR( INDIRECT(\"'\"&$W196&\"'!$B$4\"), \"\")","v":""},"S194","",false,{"$error":"#VALUE!"},"S194",null,194,{"$f":"VLOOKUP(AC196,$Z$3:$AA234,2)","v":"S1"},""]
[null,"",{"$f":"IF($AE197<>\"\",INDEX(INDIRECT(\"'\"&$AD197&\"'!$B$7:$I$100\"),$AE197,AG$2),\"\")","v":""},{"$f":"IF($AE197<>\"\",INDEX(INDIRECT(\"'\"&$AD197&\"'!$B$7:$I$100\"),$AE197,AH$2),\"\")","v":""},{"$f":"IF($AE197<>\"\",INDEX(INDIRECT(\"'\"&$AD197&\"'!$B$7:$I$100\"),$AE197,AI$2),\"\")","v":""},{"$f":"IF($AE197<>\"\",INDEX(INDIRECT(\"'\"&$AD197&\"'!$B$7:$I$100\"),$AE197,AJ$2),\"\")","v":""},{"$f":"IF($AE197<>\"\",INDEX(INDIRECT(\"'\"&$AD197&\"'!$B$7:$I$100\"),$AE197,AK$2),\"\")","v":""},{"$f":"IF($AE197<>\"\",INDEX(INDIRECT(\"'\"&$AD197&\"'!$B$7:$I$100\"),$AE197,AL$2),\"\")","v":""},{"$f":"IF($AE197<>\"\",INDEX(INDIRECT(\"'\"&$AD197&\"'!$B$7:$I$100\"),$AE197,AM$2),\"\")","v":""},{"$f":"IF($AE197<>\"\",INDEX(INDIRECT(\"'\"&$AD197&\"'!$B$7:$I$100\"),$AE197,AN$2),\"\")","v":""},null,null,null,null,null,null,null,null,null,null,null,{"$f":"IFERROR( INDIRECT(\"'\"&$W197&\"'!$B$4\"), \"\")","v":""},"S195","",false,{"$error":"#VALUE!"},"S195",null,195,{"$f":"VLOOKUP(AC197,$Z$3:$AA235,2)","v":"S1"},""]
[null,"",{"$f":"IF($AE198<>\"\",INDEX(INDIRECT(\"'\"&$AD198&\"'!$B$7:$I$100\"),$AE198,AG$2),\"\")","v":""},{"$f":"IF($AE198<>\"\",INDEX(INDIRECT(\"'\"&$AD198&\"'!$B$7:$I$100\"),$AE198,AH$2),\"\")","v":""},{"$f":"IF($AE198<>\"\",INDEX(INDIRECT(\"'\"&$AD198&\"'!$B$7:$I$100\"),$AE198,AI$2),\"\")","v":""},{"$f":"IF($AE198<>\"\",INDEX(INDIRECT(\"'\"&$AD198&\"'!$B$7:$I$100\"),$AE198,AJ$2),\"\")","v":""},{"$f":"IF($AE198<>\"\",INDEX(INDIRECT(\"'\"&$AD198&\"'!$B$7:$I$100\"),$AE198,AK$2),\"\")","v":""},{"$f":"IF($AE198<>\"\",INDEX(INDIRECT(\"'\"&$AD198&\"'!$B$7:$I$100\"),$AE198,AL$2),\"\")","v":""},{"$f":"IF($AE198<>\"\",INDEX(INDIRECT(\"'\"&$AD198&\"'!$B$7:$I$100\"),$AE198,AM$2),\"\")","v":""},{"$f":"IF($AE198<>\"\",INDEX(INDIRECT(\"'\"&$AD198&\"'!$B$7:$I$100\"),$AE198,AN$2),\"\")","v":""},null,null,null,null,null,null,null,null,null,null,null,{"$f":"IFERROR( INDIRECT(\"'\"&$W198&\"'!$B$4\"), \"\")","v":""},"S196","",false,{"$error":"#VALUE!"},"S196",null,196,{"$f":"VLOOKUP(AC198,$Z$3:$AA236,2)","v":"S1"},""]
[null,"",{"$f":"IF($AE199<>\"\",INDEX(INDIRECT(\"'\"&$AD199&\"'!$B$7:$I$100\"),$AE199,AG$2),\"\")","v":""},{"$f":"IF($AE199<>\"\",INDEX(INDIRECT(\"'\"&$AD199&\"'!$B$7:$I$100\"),$AE199,AH$2),\"\")","v":""},{"$f":"IF($AE199<>\"\",INDEX(INDIRECT(\"'\"&$AD199&\"'!$B$7:$I$100\"),$AE199,AI$2),\"\")","v":""},{"$f":"IF($AE199<>\"\",INDEX(INDIRECT(\"'\"&$AD199&\"'!$B$7:$I$100\"),$AE199,AJ$2),\"\")","v":""},{"$f":"IF($AE199<>\"\",INDEX(INDIRECT(\"'\"&$AD199&\"'!$B$7:$I$100\"),$AE199,AK$2),\"\")","v":""},{"$f":"IF($AE199<>\"\",INDEX(INDIRECT(\"'\"&$AD199&\"'!$B$7:$I$100\"),$AE199,AL$2),\"\")","v":""},{"$f":"IF($AE199<>\"\",INDEX(INDIRECT(\"'\"&$AD199&\"'!$B$7:$I$100\"),$AE199,AM$2),\"\")","v":""},{"$f":"IF($AE199<>\"\",INDEX(INDIRECT(\"'\"&$AD199&\"'!$B$7:$I$100\"),$AE199,AN$2),\"\")","v":""},null,null,null,null,null,null,null,null,null,null,null,{"$f":"IFERROR( INDIRECT(\"'\"&$W199&\"'!$B$4\"), \"\")","v":""},"S197","",false,{"$error":"#VALUE!"},"S197",null,197,{"$f":"VLOOKUP(AC199,$Z$3:$AA237,2)","v":"S1"},""]
[null,"",{"$f":"IF($AE200<>\"\",INDEX(INDIRECT(\"'\"&$AD200&\"'!$B$7:$I$100\"),$AE200,AG$2),\"\")","v":""},{"$f":"IF($AE200<>\"\",INDEX(INDIRECT(\"'\"&$AD200&\"'!$B$7:$I$100\"),$AE200,AH$2),\"\")","v":""},{"$f":"IF($AE200<>\"\",INDEX(INDIRECT(\"'\"&$AD200&\"'!$B$7:$I$100\"),$AE200,AI$2),\"\")","v":""},{"$f":"IF($AE200<>\"\",INDEX(INDIRECT(\"'\"&$AD200&\"'!$B$7:$I$100\"),$AE200,AJ$2),\"\")","v":""},{"$f":"IF($AE200<>\"\",INDEX(INDIRECT(\"'\"&$AD200&\"'!$B$7:$I$100\"),$AE200,AK$2),\"\")","v":""},{"$f":"IF($AE200<>\"\",INDEX(INDIRECT(\"'\"&$AD200&\"'!$B$7:$I$100\"),$AE200,AL$2),\"\")","v":""},{"$f":"IF($AE200<>\"\",INDEX(INDIRECT(\"'\"&$AD200&\"'!$B$7:$I$100\"),$AE200,AM$2),\"\")","v":""},{"$f":"IF($AE200<>\"\",INDEX(INDIRECT(\"'\"&$AD200&\"'!$B$7:$I$100\"),$AE200,AN$2),\"\")","v":""},null,null,null,null,null,null,null,null,null,null,null,{"$f":"IFERROR( INDIRECT(\"'\"&$W200&\"'!$B$4\"), \"\")","v":""},"S198","",false,{"$error":"#VALUE!"},"S198",null,198,{"$f":"VLOOKUP(AC200,$Z$3:$AA238,2)","v":"S1"},""]
[null,"",{"$f":"IF($AE201<>\"\",INDEX(INDIRECT(\"'\"&$AD201&\"'!$B$7:$I$100\"),$AE201,AG$2),\"\")","v":""},{"$f":"IF($AE201<>\"\",INDEX(INDIRECT(\"'\"&$AD201&\"'!$B$7:$I$100\"),$AE201,AH$2),\"\")","v":""},{"$f":"IF($AE201<>\"\",INDEX(INDIRECT(\"'\"&$AD201&\"'!$B$7:$I$100\"),$AE201,AI$2),\"\")","v":""},{"$f":"IF($AE201<>\"\",INDEX(INDIRECT(\"'\"&$AD201&\"'!$B$7:$I$100\"),$AE201,AJ$2),\"\")","v":""},{"$f":"IF($AE201<>\"\",INDEX(INDIRECT(\"'\"&$AD201&\"'!$B$7:$I$100\"),$AE201,AK$2),\"\")","v":""},{"$f":"IF($AE201<>\"\",INDEX(INDIRECT(\"'\"&$AD201&\"'!$B$7:$I$100\"),$AE201,AL$2),\"\")","v":""},{"$f":"IF($AE201<>\"\",INDEX(INDIRECT(\"'\"&$AD201&\"'!$B$7:$I$100\"),$AE201,AM$2),\"\")","v":""},{"$f":"IF($AE201<>\"\",INDEX(INDIRECT(\"'\"&$AD201&\"'!$B$7:$I$100\"),$AE201,AN$2),\"\")","v":""},null,null,null,null,null,null,null,null,null,null,null,{"$f":"IFERROR( INDIRECT(\"'\"&$W201&\"'!$B$4\"), \"\")","v":""},"S199","",false,{"$error":"#VALUE!"},"S199",null,199,{"$f":"VLOOKUP(AC201,$Z$3:$AA239,2)","v":"S1"},""]
[null,"",{"$f":"IF($AE202<>\"\",INDEX(INDIRECT(\"'\"&$AD202&\"'!$B$7:$I$100\"),$AE202,AG$2),\"\")","v":""},{"$f":"IF($AE202<>\"\",INDEX(INDIRECT(\"'\"&$AD202&\"'!$B$7:$I$100\"),$AE202,AH$2),\"\")","v":""},{"$f":"IF($AE202<>\"\",INDEX(INDIRECT(\"'\"&$AD202&\"'!$B$7:$I$100\"),$AE202,AI$2),\"\")","v":""},{"$f":"IF($AE202<>\"\",INDEX(INDIRECT(\"'\"&$AD202&\"'!$B$7:$I$100\"),$AE202,AJ$2),\"\")","v":""},{"$f":"IF($AE202<>\"\",INDEX(INDIRECT(\"'\"&$AD202&\"'!$B$7:$I$100\"),$AE202,AK$2),\"\")","v":""},{"$f":"IF($AE202<>\"\",INDEX(INDIRECT(\"'\"&$AD202&\"'!$B$7:$I$100\"),$AE202,AL$2),\"\")","v":""},{"$f":"IF($AE202<>\"\",INDEX(INDIRECT(\"'\"&$AD202&\"'!$B$7:$I$100\"),$AE202,AM$2),\"\")","v":""},{"$f":"IF($AE202<>\"\",INDEX(INDIRECT(\"'\"&$AD202&\"'!$B$7:$I$100\"),$AE202,AN$2),\"\")","v":""},null,null,null,null,null,null,null,null,null,null,null,{"$f":"IFERROR( INDIRECT(\"'\"&$W202&\"'!$B$4\"), \"\")","v":""},"S200","",false,{"$error":"#VALUE!"},"S200",null,200,{"$f":"VLOOKUP(AC202,$Z$3:$AA240,2)","v":"S1"},""]
[null,"",{"$f":"IF($AE203<>\"\",INDEX(INDIRECT(\"'\"&$AD203&\"'!$B$7:$I$100\"),$AE203,AG$2),\"\")","v":""},{"$f":"IF($AE203<>\"\",INDEX(INDIRECT(\"'\"&$AD203&\"'!$B$7:$I$100\"),$AE203,AH$2),\"\")","v":""},{"$f":"IF($AE203<>\"\",INDEX(INDIRECT(\"'\"&$AD203&\"'!$B$7:$I$100\"),$AE203,AI$2),\"\")","v":""},{"$f":"IF($AE203<>\"\",INDEX(INDIRECT(\"'\"&$AD203&\"'!$B$7:$I$100\"),$AE203,AJ$2),\"\")","v":""},{"$f":"IF($AE203<>\"\",INDEX(INDIRECT(\"'\"&$AD203&\"'!$B$7:$I$100\"),$AE203,AK$2),\"\")","v":""},{"$f":"IF($AE203<>\"\",INDEX(INDIRECT(\"'\"&$AD203&\"'!$B$7:$I$100\"),$AE203,AL$2),\"\")","v":""},{"$f":"IF($AE203<>\"\",INDEX(INDIRECT(\"'\"&$AD203&\"'!$B$7:$I$100\"),$AE203,AM$2),\"\")","v":""},{"$f":"IF($AE203<>\"\",INDEX(INDIRECT(\"'\"&$AD203&\"'!$B$7:$I$100\"),$AE203,AN$2),\"\")","v":""},null,null,null,null,null,null,null,null,null,null,null,{"$f":"IFERROR( INDIRECT(\"'\"&$W203&\"'!$B$4\"), \"\")","v":""},"S201","",false,{"$error":"#VALUE!"},"S201",null,201,{"$f":"VLOOKUP(AC203,$Z$3:$AA241,2)","v":"S1"},""]
[]
[]
[]
[]
[]
[]
[]
[]
[]
[]
[]
[]
[]
[]
[]
[]
[]
[]
[]
[]
[]
[]
[]
[]
[]
[]
[]
[]
[]
[]
[]
[]
[]
[]
[]
[]
[]
[]
[]
[]
[]
[]
[]
[]
[]
[]
[]
[]
[]
[]
[]
[]
[]
[]
[]
[]
[]
[]
[]
[]
[]
[]
[]
[]
[]
[]
[]
[]
[]
[]
[]
[]
[]
[]
[]
[]
[]
[]
[]
[]
[]
[]
[]
[]
[]
[]
[]
[]
[]
[]
[]
[]
[]
[]
[]
[]
[]
[]
[]
[]
[]
[]
[]
[]
[]
[]
[]
[]
[]
[]
[]
[]
[]
[]
[]
[]
[]
[]
[]
[]
[]
[]
[]
[]
[]
[]
[]
[]
[]
[]
[]
[]
[]
[]
[]
[]
[]
[]
[]
[]
[]
[]
[]
[]
[]
[]
[]
[]
[]
[]
[]
[]
[]
[]
[]
[]
[]
[]
[]
[]
[]
[]
[]
[]
[]
[]
[]
[]
[]
[]
[]
[]
[]
[]
[]
[]
[]
[]
[]
[]
[]
[]
[]
[]
[]
[]
[]
[]
[]
[]
[]
[]
[]
[]
[]
[]
[]
[]
[null,"Tema","Tema","Insats","Aktör","Uppskattad resursåtgång",null,"Förväntad effekt","Prio-värde",null,"Tips: Använd pilknapparna för att filtrera ut insatser ex. inom ett visst tema eller för att sortera insatserna i en annan ordning"]
[null,"Avvikelserapportering","Avvikelserapportering","lite text","alla","Liten",null,"Stor",6]
[]
[]
[]
[]
[]
[null,"Tema","Tema","Insats","Aktör","Uppskattad resursåtgång",null,"Förväntad effekt","Prio-värde",null,"Tips: Använd pilknapparna för att filtrera ut insatser ex. inom ett visst tema eller för att sortera insatserna i en annan ordning"]
[null,"Avvikelserapportering","Avvikelserapportering","lite text","alla","Liten",null,"Stor",6]
[]
[]
[]
[]
[]
[null,"Tema","Tema","Insats","Aktör","Uppskattad resursåtgång",null,"Förväntad effekt","Prio-värde",null,"Tips: Använd pilknapparna för att filtrera ut insatser ex. inom ett visst tema eller för att sortera insatserna i en annan ordning"]
[null,"Avvikelserapportering","Avvikelserapportering","lite text","alla","Liten",null,"Stor",6]
[]
[]
[]
[]
[]
[null,"Tema","Tema","Insats","Aktör","Uppskattad resursåtgång",null,"Förväntad effekt","Prio-värde",null,"Tips: Använd pilknapparna för att filtrera ut insatser ex. inom ett visst tema eller för att sortera insatserna i en annan ordning"]
[null,"Avvikelserapportering","Avvikelserapportering","lite text","alla","Liten",null,"Stor",6]
[]
[]
[]
[]
[]
[null,"Tema","Tema","Insats","Aktör","Uppskattad resursåtgång",null,"Förväntad effekt","Prio-värde",null,"Tips: Använd pilknapparna för att filtrera ut insatser ex. inom ett visst tema eller för att sortera insatserna i en annan ordning"]
[null,"Avvikelserapportering","Avvikelserapportering","lite text","alla","Liten",null,"Stor",6]
[]
[null,"Prioritering av utmaningar, Region Dalarna","Prioritering av utmaningar, Region Dalarna"]
[null,"Nulägesanalys genomförd av: ","Nulägesanalys genomförd av: "]
[null,"Nulägesanalysen avser: psykiatri","Nulägesanalysen avser: psykiatri"]
[null,"Område","Område"]
[null,"Område","Område","Tema","Insats","Aktör",null,"Uppskattad resursåtgång","Förväntad effekt","Prio-värde",null,"Tips: Använd pilknapparna för att filtrera ut insatser ex. inom ett visst tema eller för att sortera insatserna i en annan ordning"]
[null,"Fokusområde 1: Öka kunskap om inträffade vårdskador","Fokusområde 1: Öka kunskap om inträffade vårdskador","Avvikelserapportering","lite text","alla",null,"Liten","Stor",6]
[]
[null,"Prioritering av utmaningar, Region Dalarna","Prioritering av utmaningar, Region Dalarna"]
[null,"Nulägesanalys genomförd av: ","Nulägesanalys genomförd av: "]
[null,"Nulägesanalysen avser: somatik","Nulägesanalysen avser: somatik"]
[null,"Område","Område"]
[null,"Område","Område","Tema","Insats","Aktör",null,"Uppskattad resursåtgång","Förväntad effekt","Prio-värde",null,"Tips: Använd pilknapparna för att filtrera ut insatser ex. inom ett visst tema eller för att sortera insatserna i en annan ordning"]
[null,"Fokusområde 1: Öka kunskap om inträffade vårdskador","Fokusområde 1: Öka kunskap om inträffade vårdskador","Avvikelserapportering","lite text","alla",null,"Liten","Stor",6]
[null,null,"Fokusområde 1: Öka kunskap om inträffade vårdskador","Avvikelserapportering","lite text","alla",null,"Liten","Stor",6]
[null,null,2]
[null,null,1]
[null,null,"Fokusområde 1: Öka kunskap om inträffade vårdskador","Avvikelserapportering","lite text","alla",null,"Liten","Stor",6]
[]
[null,null,"Prioritering av utmaningar, Region Dalarna"]
[null,null,"Nulägesanalys genomförd av: "]
[null,null,"Nulägesanalysen avser: psykiatri"]
[null,null,"Område"]
[null,null,"Område","Tema","Insats","Aktör",null,"Uppskattad resursåtgång","Förväntad effekt","Prio-värde"]
[null,null,"Fokusområde 1: Öka kunskap om inträffade vårdskador","Avvikelserapportering","lite text","alla",null,"Liten","Stor",6]
[]
[null,null,"Prioritering av utmaningar, Region Dalarna"]
[null,null,"Nulägesanalys genomförd av: "]
[null,null,"Nulägesanalysen avser: somatik"]
[null,null,"Område"]
[null,null,"Område","Tema","Insats","Aktör",null,"Uppskattad resursåtgång","Förväntad effekt","Prio-värde"]
[null,null,"Fokusområde 1: Öka kunskap om inträffade vårdskador","Avvikelserapportering","lite text","alla",null,"Liten","Stor",6]
[null,"Fokusområde 1: Öka kunskap om inträffade vårdskador","Avvikelserapportering","lite text","alla","Liten",null,"Stor",6]
[null,2]
[null,1]
[null,"Fokusområde 1: Öka kunskap om inträffade vårdskador","Avvikelserapportering","lite text","alla","Liten",null,"Stor",6]
[null,2]
[null,1]
[null,"Fokusområde 1: Öka kunskap om inträffade vårdskador","Avvikelserapportering","lite text","alla","Liten",null,"Stor",6]
[null,2]
[null,1]
[null,"Fokusområde 1: Öka kunskap om inträffade vårdskador","Avvikelserapportering","lite text","alla","Liten",null,"Stor",6]
[null,2]
[null,1]
[null,"Fokusområde 1: Öka kunskap om inträffade vårdskador","Avvikelserapportering","lite text","alla","Liten",null,"Stor",6]
[null,2]
[null,1]

{"sheet":"Introduktion","index":3,"n_rows":31,"n_cols":5,"rows_kept":31,"cut":false,"hidden":false,"merged":[[28,1,28,2],[29,1,29,2],[30,1,30,2],[22,1,22,4],[3,1,5,4],[25,1,25,2],[26,1,26,2],[27,1,27,2],[17,1,18,1],[8,1,8,4],[9,1,9,4],[12,1,12,4]]}
[]
[]
[null,"Introduktion till denna Excelfil"]
[null,"Denna fil, Sammanställning av flera verktyg för stärkt patientsäkerhet inom kunskapsstyrning, är utvecklad av Nationell samverkansgrupp för patientsäkerhet (NSG patientsäkerhet) i samverkan med Sveriges Kommuner och Regioner (SKR). Denna fil är framtagen tillsammans med Verktyg för stärkt patientsäkerhet inom kunskapsstyrning, för att möjliggöra sammanställning av olika nulägesanalyser och identifierade insatser då verktyget har använts på flera ställen inom ett programområde. Syftet är att stödja de nationella programområdena (NPO) i deras kunskapsstyrning för ökad patientsäkerhet, i enlighet med den nationella handlingsplanen för ökad patientsäkerhet. \n\nExcelfilens uppbyggnad\nExcelfilen Sammanställning av flera verktyg för stärkt patientsäkerhet inom kunskapsstyrning ger en sammanfattning av de olika nulägesanalyser och identifierade insatser som ni har tagit fram där ni använt verktyget Verktyg för stärkt patientsäkerhet inom kunskapsstyrning. Filen består av följande flikar:\n- Introduktion ger instruktioner till hur filen kan användas och länkar vidare till filens olika delar\n- Import är den flik som ni använder för att importera information från de verktyg som ni vill sammanställa\n- 1.1 Sammanvägd nulägesanalys ger sammanvägda svar på frågorna per tema för de olika nulägesanalyserna\n- 1.2 Nulägesöversikt ger er möjlighet att välja ett temaområde och se resultatet uppdelat per genomförd nulägesanalys\n- 2.1 Sammanställning sammanställer en lista över alla identifierade insatser för de olika ställen där verktyget har använts. \n\nVill ni rensa era svar i verktyget under en viss flik eller i hela dokumentet?\nLängst ned på denna sida finns en knapp för att nollställa hela verktyget. Notera att allt ni fyllt i kommer att raderas om ni väljer att klicka på denna. Om ni enbart vill nollställa det ni fyllt i under en viss flik för att börja om från början, går detta att göra under den enskilda fliken. \n\n\n"]
[]
[]
[]
[null,"Instruktioner finns i genomförandestödet"]
[null,"Instruktioner för användning finns i genomförandestöd (del 1, s. 25). En kortfattad beskrivning av innehållet under respektive flik finns även nedan. Genomförandestödet kan hittas via kunskapsstyrningsorganisationens webbsida, länk nedan."]
[null,"Länk till webbsida"]
[]
[null,"Upplever ni tekniska problem?"]
[null,"Funktionaliteten i Excelfilen är uppbyggd med hjälp av så kallade makron. Beroende på vilka säkerhetsinställningar ni har kan ni behöva acceptera/godkänna att makron används när filen öppnas. Vissa datorer kan använda grundinställningar för Excel som inaktiverar alla makron utan att visa något meddelande. Det går då att använda filen genom att spara denna på en betrodd plats. Ni lägger till en betrodd plats genom att:\n- Klicka på Arkiv i menyfliksområdet i denna fil --> Klicka sedan på Alternativ.\n- Klicka på Säkerhetscenter --> Inställningar för Säkerhetscenter --> Betrodda platser.\n- Klicka på Lägg till ny plats.\n- Klicka på Bläddra. Leta upp och välj en mapp. Klicka på OK.\n\nFör att viktig funktionalitet inte ska försvinna är det även viktigt att använda en senare version av Excel. Filen går inte att använda i Excel 2003–2007. \n\nNotera följande avseende funktionaliteten i Excelfilen: \n- Det kan ta upp till ett par minuter för Excelfilen att importera data och skapa en sammanställning i första fliken. Detta är helt normalt och beror på att information hämtas och bearbetas från de olika verktygen som ska sammanställas.\n- Det är viktigt att de verktyg som ska sammanställas sparas i en gemensam mapp och att inga andra filer ligger i samma mapp. Om man exempelvis sparar denna Excelfil i samma mapp som de verktyg som ska sammanställas så kommer denna Excelfil inte att fungera."]
[]
[null,"Innehåll och kort om användning"]
[null,"Del","Flik","Innehåll","Stöd för användning"]
[null,null,"Import","Är den flik som ni använder för att importera information från de verktyg som ni vill sammanställa","Innan ni sammanställer resultaten är det viktigt att alla de verktyg som ni vill analysera ligger i en gemensam mapp som enbart innehåller dessa filer. I samtliga filer måste det dessutom stå angivet vilket område som nulägesanalysen avser i cell B7 i flik 1.1. Nulägesanalys.\n\nSammanställningen av resultat sker via fliken Import. I denna flik väljer ni först vilken mapp som Excelfilen ska hämta information om verktygen från. Det innebär att ni först måste samla alla aktuella verktyg i en gemensam mapp. Därefter sker sammanställningen i två steg: \n-\tVia knappen ”Välj mapp för sammanställning” går ni in och specificerar den mapp där ni har sparat Excelverktygen\n\n-\tDärefter kan ni trycka på ”skapa sammanställning” för att importera information från de olika verktygen. Observera att detta steg kan ta flera minuter att genomföra."]
[null,1,"1.1 Sammanvägd nulägesanalys","I fliken är det möjligt att se ett sammanvägt svar för alla genomförda nulägesanalyser. ","För varje tema och per fråga A, B och C finns det en sammanvägning som visar på om det genomsnittliga svaret är ja, ja i huvudsak, till viss del eller nej (med hjälp av en färgskala som går från grönt till rött, se nedan). Därutöver är det också möjligt att se hur stor andel av de svarande som har angett att tillräcklig information saknas, och när den andelen uppgår till 25 procent eller mer markeras den aktuella cellen som gul, tillsammans med en gul flaggsymbol."]
[null,null,"1.2 Nulägesöversikt","Ger er möjlighet att välja ett tema och se resultatet uppdelat per genomförd nulägesanalys","Om ni vid genomgången av den sammanvägda nulägesanalysen vill titta närmre på ett tema och hur de olika ställena som genomfört nulägesanalysen har svarat kan ni göra det via denna flik. Här kan ni välja vilket tema ni vill titta närmre på och se vilken bedömning som har gjorts i varje enskild nulägesanalys för det aktuella temat. Det kan vara aktuellt för de teman där många har angett att information saknas eller där många har svarat att de inte har kunskap, stöd eller implementerar den kunskap och stöd som finns.\n\nObservera! Även de frågor som inte är besvarade kommer att markeras gula på samma sätt som \"tillräcklig information saknas.\""]
[null,2,"2.1 Sammanställning","Här listas alla de insatser som har identifierats på de olika ställen inom programområdet där verktyget har använts","Här får ni en överblick över insatserna. Sammanställningen är ett stöd för att kunna ta fram en plan för det fortsatta patientsäkerhetsarbetet.\n\nFör att filtrera och sortera i resultatet, använd pilknapparna i rubrikraden (se rödmarkerat exempel nedan):\n\n\n\n"]
[]
[null,"Svarsalternativ för nulägesanalysens flervalsfrågor, som visas i flik 1.1 Sammanvägd nulägesanalys"]
[]
[]
[null,"Svarsalternativ för nulägesanalysens flervalsfrågor, som visas i flik 1.2 Nulägesöversikt"]
[null,"Svarsalternativ",null,"Fylls i när följande gäller","Symbol i resultatfliken "]
[null,"Ja",null,"När det går att svara ja för samtliga delar av programområdet som analyserats.",2]
[null,"Ja, i huvudsak",null,"När det går att svara ja, men med mindre undantag inom de delar av programområdet som analyserats.",1]
[null,"Till viss del ",null,"När det går att svara ja bara till viss del eller enbart för vissa av de delar av programområdet som analyserats. Ett eller flera viktiga undantag kan finnas, exempelvis inom en av de stora diagnosgrupperna.",-1]
[null,"Nej",null,"När svaret är nej för samtliga delar av programområdet som analyserats.",-2]
[null,"Tillräcklig info saknas",null,"När de som genomför nulägesanalysen har brist på information om nuläget inom de delar av programområdet som analyserats. Detta svarsalternativ används när det finns ett behov av ytterligare kartläggning/inhämtning av information för att besvara om utmaningar föreligger eller ej. ",0]

{"sheet":"Import","index":4,"n_rows":1,"n_cols":2,"rows_kept":1,"cut":false,"hidden":false,"merged":[]}
[null,"Mapp som analysen utgår från:"]

{"sheet":"1.1 Sammanvägd nulägesanalys","index":5,"n_rows":33,"n_cols":20,"rows_kept":33,"cut":false,"hidden":false,"merged":[[3,2,3,3],[3,4,3,5],[3,6,3,7],[1,2,1,7],[3,9,4,15]]}
[]
[null,"Sammanvägd nulägesanalys",{"$f":"IF('N data'!B2=\"\",\"\",'N data'!B2)","v":""}]
[]
[null,null,"A. Tillräcklig kunskap?",null,"B. Tillräckliga stöd?",null,"C. Används kunskap och stöd?",null,null,"Information: På denna sida ser ni ett sammanvägt resultat för alla genomförda nulägesanalyser som inkluderats i sammanställningen. \n\nFör varje tema och per fråga A, B och C finns det en sammanvägning av samtliga resultat utifrån färgskalan nedan. Därutöver ser ni hur stor andel av de svarande som har angett att tillräcklig information saknas i en egen cell för varje fråga. När andelen uppgår till 25 procent eller mer markeras den aktuella cellen som gul, tillsammans med en gul flaggsymbol."]
[null,null,"Sammanvägt svar (ja, ja i huvudsak, till viss del, nej)","Andel som svarat att tillräcklig information saknas ","Sammanvägt svar (ja, ja i huvudsak, till viss del, nej)","Andel som svarat att tillräcklig information saknas ","Sammanvägt svar (ja, ja i huvudsak, till viss del, nej)","Andel som svarat att tillräcklig information saknas "]
[null,"\nGrundläggande förutsättningar för patientsäkerhetsarbete"]
[null,"En god säkerhetskultur",{"$f":"IFERROR(VLOOKUP(CONCATENATE('1.1 Sammanvägd nulägesanalys'!$B7,'1.1 Sammanvägd nulägesanalys'!$C$4),'N data'!$N$1:$BG$133,2,FALSE),\"\")","v":""},{"$f":"IFERROR(VLOOKUP(CONCATENATE('1.1 Sammanvägd nulägesanalys'!$B7,'1.1 Sammanvägd nulägesanalys'!$C$4),'N data'!$N$1:$BG$133,5,FALSE),\"\")","v":""},{"$f":"IFERROR(VLOOKUP(CONCATENATE('1.1 Sammanvägd nulägesanalys'!$B7,'1.1 Sammanvägd nulägesanalys'!$E$4),'N data'!$N$1:$BG$133,2,FALSE),\"\")","v":""},{"$f":"IFERROR(VLOOKUP(CONCATENATE('1.1 Sammanvägd nulägesanalys'!$B7,'1.1 Sammanvägd nulägesanalys'!$E$4),'N data'!$N$1:$BG$133,5,FALSE),\"\")","v":""},{"$f":"IFERROR(VLOOKUP(CONCATENATE('1.1 Sammanvägd nulägesanalys'!$B7,'1.1 Sammanvägd nulägesanalys'!$G$4),'N data'!$N$1:$BG$133,2,FALSE),\"\")","v":""},{"$f":"IFERROR(VLOOKUP(CONCATENATE('1.1 Sammanvägd nulägesanalys'!$B7,'1.1 Sammanvägd nulägesanalys'!$G$4),'N data'!$N$1:$BG$133,5,FALSE),\"\")","v":""},null,null,null,null,null,null,null,null,null,{"$f":"CONCATENATE($B7,C$4)","v":"En god säkerhetskulturA. Tillräcklig kunskap?"},{"$f":"CONCATENATE($B7,E$4)","v":"En god säkerhetskulturB. Tillräckliga stöd?"},{"$f":"CONCATENATE($B7,G$4)","v":"En god säkerhetskulturC. Används kunskap och stöd?"}]
[null,"Adekvat kunskap och kompetens",{"$f":"IFERROR(VLOOKUP(CONCATENATE('1.1 Sammanvägd nulägesanalys'!$B8,'1.1 Sammanvägd nulägesanalys'!$C$4),'N data'!$N$1:$BG$133,2,FALSE),\"\")","v":""},{"$f":"IFERROR(VLOOKUP(CONCATENATE('1.1 Sammanvägd nulägesanalys'!$B8,'1.1 Sammanvägd nulägesanalys'!$C$4),'N data'!$N$1:$BG$133,5,FALSE),\"\")","v":""},{"$f":"IFERROR(VLOOKUP(CONCATENATE('1.1 Sammanvägd nulägesanalys'!$B8,'1.1 Sammanvägd nulägesanalys'!$E$4),'N data'!$N$1:$BG$133,2,FALSE),\"\")","v":""},{"$f":"IFERROR(VLOOKUP(CONCATENATE('1.1 Sammanvägd nulägesanalys'!$B8,'1.1 Sammanvägd nulägesanalys'!$E$4),'N data'!$N$1:$BG$133,5,FALSE),\"\")","v":""},{"$f":"IFERROR(VLOOKUP(CONCATENATE('1.1 Sammanvägd nulägesanalys'!$B8,'1.1 Sammanvägd nulägesanalys'!$G$4),'N data'!$N$1:$BG$133,2,FALSE),\"\")","v":""},{"$f":"IFERROR(VLOOKUP(CONCATENATE('1.1 Sammanvägd nulägesanalys'!$B8,'1.1 Sammanvägd nulägesanalys'!$G$4),'N data'!$N$1:$BG$133,5,FALSE),\"\")","v":""},null,null,null,null,null,null,null,null,null,{"$f":"CONCATENATE($B8,C$4)","v":"Adekvat kunskap och kompetensA. Tillräcklig kunskap?"},{"$f":"CONCATENATE($B8,E$4)","v":"Adekvat kunskap och kompetensB. Tillräckliga stöd?"},{"$f":"CONCATENATE($B8,G$4)","v":"Adekvat kunskap och kompetensC. Används kunskap och stöd?"}]
[null,"Patienten som medskapare",{"$f":"IFERROR(VLOOKUP(CONCATENATE('1.1 Sammanvägd nulägesanalys'!$B9,'1.1 Sammanvägd nulägesanalys'!$C$4),'N data'!$N$1:$BG$133,2,FALSE),\"\")","v":""},{"$f":"IFERROR(VLOOKUP(CONCATENATE('1.1 Sammanvägd nulägesanalys'!$B9,'1.1 Sammanvägd nulägesanalys'!$C$4),'N data'!$N$1:$BG$133,5,FALSE),\"\")","v":""},{"$f":"IFERROR(VLOOKUP(CONCATENATE('1.1 Sammanvägd nulägesanalys'!$B9,'1.1 Sammanvägd nulägesanalys'!$E$4),'N data'!$N$1:$BG$133,2,FALSE),\"\")","v":""},{"$f":"IFERROR(VLOOKUP(CONCATENATE('1.1 Sammanvägd nulägesanalys'!$B9,'1.1 Sammanvägd nulägesanalys'!$E$4),'N data'!$N$1:$BG$133,5,FALSE),\"\")","v":""},{"$f":"IFERROR(VLOOKUP(CONCATENATE('1.1 Sammanvägd nulägesanalys'!$B9,'1.1 Sammanvägd nulägesanalys'!$G$4),'N data'!$N$1:$BG$133,2,FALSE),\"\")","v":""},{"$f":"IFERROR(VLOOKUP(CONCATENATE('1.1 Sammanvägd nulägesanalys'!$B9,'1.1 Sammanvägd nulägesanalys'!$G$4),'N data'!$N$1:$BG$133,5,FALSE),\"\")","v":""}]
[null,"Patienter och närståendes erfarenheter av vårdskador",{"$f":"IFERROR(VLOOKUP(CONCATENATE('1.1 Sammanvägd nulägesanalys'!$B10,'1.1 Sammanvägd nulägesanalys'!$C$4),'N data'!$N$1:$BG$133,2,FALSE),\"\")","v":""},{"$f":"IFERROR(VLOOKUP(CONCATENATE('1.1 Sammanvägd nulägesanalys'!$B10,'1.1 Sammanvägd nulägesanalys'!$C$4),'N data'!$N$1:$BG$133,5,FALSE),\"\")","v":""},{"$f":"IFERROR(VLOOKUP(CONCATENATE('1.1 Sammanvägd nulägesanalys'!$B10,'1.1 Sammanvägd nulägesanalys'!$E$4),'N data'!$N$1:$BG$133,2,FALSE),\"\")","v":""},{"$f":"IFERROR(VLOOKUP(CONCATENATE('1.1 Sammanvägd nulägesanalys'!$B10,'1.1 Sammanvägd nulägesanalys'!$E$4),'N data'!$N$1:$BG$133,5,FALSE),\"\")","v":""},{"$f":"IFERROR(VLOOKUP(CONCATENATE('1.1 Sammanvägd nulägesanalys'!$B10,'1.1 Sammanvägd nulägesanalys'!$G$4),'N data'!$N$1:$BG$133,2,FALSE),\"\")","v":""},{"$f":"IFERROR(VLOOKUP(CONCATENATE('1.1 Sammanvägd nulägesanalys'!$B10,'1.1 Sammanvägd nulägesanalys'!$G$4),'N data'!$N$1:$BG$133,5,FALSE),\"\")","v":""},null,null,null,null,null,null,null,null,null,{"$f":"CONCATENATE($B10,C$4)","v":"Patienter och närståendes erfarenheter av vårdskadorA. Tillräcklig kunskap?"},{"$f":"CONCATENATE($B10,E$4)","v":"Patienter och närståendes erfarenheter av vårdskadorB. Tillräckliga stöd?"},{"$f":"CONCATENATE($B10,G$4)","v":"Patienter och närståendes erfarenheter av vårdskadorC. Används kunskap och stöd?"}]
[null,"Patientmedverkan i utveckling av processer och arbetssätt",{"$f":"IFERROR(VLOOKUP(CONCATENATE('1.1 Sammanvägd nulägesanalys'!$B11,'1.1 Sammanvägd nulägesanalys'!$C$4),'N data'!$N$1:$BG$133,2,FALSE),\"\")","v":""},{"$f":"IFERROR(VLOOKUP(CONCATENATE('1.1 Sammanvägd nulägesanalys'!$B11,'1.1 Sammanvägd nulägesanalys'!$C$4),'N data'!$N$1:$BG$133,5,FALSE),\"\")","v":""},{"$f":"IFERROR(VLOOKUP(CONCATENATE('1.1 Sammanvägd nulägesanalys'!$B11,'1.1 Sammanvägd nulägesanalys'!$E$4),'N data'!$N$1:$BG$133,2,FALSE),\"\")","v":""},{"$f":"IFERROR(VLOOKUP(CONCATENATE('1.1 Sammanvägd nulägesanalys'!$B11,'1.1 Sammanvägd nulägesanalys'!$E$4),'N data'!$N$1:$BG$133,5,FALSE),\"\")","v":""},{"$f":"IFERROR(VLOOKUP(CONCATENATE('1.1 Sammanvägd nulägesanalys'!$B11,'1.1 Sammanvägd nulägesanalys'!$G$4),'N data'!$N$1:$BG$133,2,FALSE),\"\")","v":""},{"$f":"IFERROR(VLOOKUP(CONCATENATE('1.1 Sammanvägd nulägesanalys'!$B11,'1.1 Sammanvägd nulägesanalys'!$G$4),'N data'!$N$1:$BG$133,5,FALSE),\"\")","v":""},null,null,null,null,null,null,null,null,null,{"$f":"CONCATENATE($B11,C$4)","v":"Patientmedverkan i utveckling av processer och arbetssättA. Tillräcklig kunskap?"},{"$f":"CONCATENATE($B11,E$4)","v":"Patientmedverkan i utveckling av processer och arbetssättB. Tillräckliga stöd?"},{"$f":"CONCATENATE($B11,G$4)","v":"Patientmedverkan i utveckling av processer och arbetssättC. Används kunskap och stöd?"}]
[null,"Patientens delaktighet i den egna vården",{"$f":"IFERROR(VLOOKUP(CONCATENATE('1.1 Sammanvägd nulägesanalys'!$B12,'1.1 Sammanvägd nulägesanalys'!$C$4),'N data'!$N$1:$BG$133,2,FALSE),\"\")","v":""},{"$f":"IFERROR(VLOOKUP(CONCATENATE('1.1 Sammanvägd nulägesanalys'!$B12,'1.1 Sammanvägd nulägesanalys'!$C$4),'N data'!$N$1:$BG$133,5,FALSE),\"\")","v":""},{"$f":"IFERROR(VLOOKUP(CONCATENATE('1.1 Sammanvägd nulägesanalys'!$B12,'1.1 Sammanvägd nulägesanalys'!$E$4),'N data'!$N$1:$BG$133,2,FALSE),\"\")","v":""},{"$f":"IFERROR(VLOOKUP(CONCATENATE('1.1 Sammanvägd nulägesanalys'!$B12,'1.1 Sammanvägd nulägesanalys'!$E$4),'N data'!$N$1:$BG$133,5,FALSE),\"\")","v":""},{"$f":"IFERROR(VLOOKUP(CONCATENATE('1.1 Sammanvägd nulägesanalys'!$B12,'1.1 Sammanvägd nulägesanalys'!$G$4),'N data'!$N$1:$BG$133,2,FALSE),\"\")","v":""},{"$f":"IFERROR(VLOOKUP(CONCATENATE('1.1 Sammanvägd nulägesanalys'!$B12,'1.1 Sammanvägd nulägesanalys'!$G$4),'N data'!$N$1:$BG$133,5,FALSE),\"\")","v":""}]
[null,"Patientmedverkan för ökad riskmedvetenhet och beredskap",{"$f":"IFERROR(VLOOKUP(CONCATENATE('1.1 Sammanvägd nulägesanalys'!$B13,'1.1 Sammanvägd nulägesanalys'!$C$4),'N data'!$N$1:$BG$133,2,FALSE),\"\")","v":""},{"$f":"IFERROR(VLOOKUP(CONCATENATE('1.1 Sammanvägd nulägesanalys'!$B13,'1.1 Sammanvägd nulägesanalys'!$C$4),'N data'!$N$1:$BG$133,5,FALSE),\"\")","v":""},{"$f":"IFERROR(VLOOKUP(CONCATENATE('1.1 Sammanvägd nulägesanalys'!$B13,'1.1 Sammanvägd nulägesanalys'!$E$4),'N data'!$N$1:$BG$133,2,FALSE),\"\")","v":""},{"$f":"IFERROR(VLOOKUP(CONCATENATE('1.1 Sammanvägd nulägesanalys'!$B13,'1.1 Sammanvägd nulägesanalys'!$E$4),'N data'!$N$1:$BG$133,5,FALSE),\"\")","v":""},{"$f":"IFERROR(VLOOKUP(CONCATENATE('1.1 Sammanvägd nulägesanalys'!$B13,'1.1 Sammanvägd nulägesanalys'!$G$4),'N data'!$N$1:$BG$133,2,FALSE),\"\")","v":""},{"$f":"IFERROR(VLOOKUP(CONCATENATE('1.1 Sammanvägd nulägesanalys'!$B13,'1.1 Sammanvägd nulägesanalys'!$G$4),'N data'!$N$1:$BG$133,5,FALSE),\"\")","v":""}]
[null,"\nFokusområde 1: Öka kunskap om inträffade vårdskador"]
[null,"Identifiering, sammanställning och aggregering av information om vårdskador",{"$f":"IFERROR(VLOOKUP(CONCATENATE('1.1 Sammanvägd nulägesanalys'!$B15,'1.1 Sammanvägd nulägesanalys'!$C$4),'N data'!$N$1:$BG$133,2,FALSE),\"\")","v":""},{"$f":"IFERROR(VLOOKUP(CONCATENATE('1.1 Sammanvägd nulägesanalys'!$B15,'1.1 Sammanvägd nulägesanalys'!$C$4),'N data'!$N$1:$BG$133,5,FALSE),\"\")","v":""},{"$f":"IFERROR(VLOOKUP(CONCATENATE('1.1 Sammanvägd nulägesanalys'!$B15,'1.1 Sammanvägd nulägesanalys'!$E$4),'N data'!$N$1:$BG$133,2,FALSE),\"\")","v":""},{"$f":"IFERROR(VLOOKUP(CONCATENATE('1.1 Sammanvägd nulägesanalys'!$B15,'1.1 Sammanvägd nulägesanalys'!$E$4),'N data'!$N$1:$BG$133,5,FALSE),\"\")","v":""},{"$f":"IFERROR(VLOOKUP(CONCATENATE('1.1 Sammanvägd nulägesanalys'!$B15,'1.1 Sammanvägd nulägesanalys'!$G$4),'N data'!$N$1:$BG$133,2,FALSE),\"\")","v":""},{"$f":"IFERROR(VLOOKUP(CONCATENATE('1.1 Sammanvägd nulägesanalys'!$B15,'1.1 Sammanvägd nulägesanalys'!$G$4),'N data'!$N$1:$BG$133,5,FALSE),\"\")","v":""},null,null,null,null,null,null,null,null,null,{"$f":"CONCATENATE($B15,C$4)","v":"Identifiering, sammanställning och aggregering av information om vårdskadorA. Tillräcklig kunskap?"},{"$f":"CONCATENATE($B15,E$4)","v":"Identifiering, sammanställning och aggregering av information om vårdskadorB. Tillräckliga stöd?"},{"$f":"CONCATENATE($B15,G$4)","v":"Identifiering, sammanställning och aggregering av information om vårdskadorC. Används kunskap och stöd?"}]
[null,"Minimering av effekter av negativa händelser",{"$f":"IFERROR(VLOOKUP(CONCATENATE('1.1 Sammanvägd nulägesanalys'!$B16,'1.1 Sammanvägd nulägesanalys'!$C$4),'N data'!$N$1:$BG$133,2,FALSE),\"\")","v":""},{"$f":"IFERROR(VLOOKUP(CONCATENATE('1.1 Sammanvägd nulägesanalys'!$B16,'1.1 Sammanvägd nulägesanalys'!$C$4),'N data'!$N$1:$BG$133,5,FALSE),\"\")","v":""},{"$f":"IFERROR(VLOOKUP(CONCATENATE('1.1 Sammanvägd nulägesanalys'!$B16,'1.1 Sammanvägd nulägesanalys'!$E$4),'N data'!$N$1:$BG$133,2,FALSE),\"\")","v":""},{"$f":"IFERROR(VLOOKUP(CONCATENATE('1.1 Sammanvägd nulägesanalys'!$B16,'1.1 Sammanvägd nulägesanalys'!$E$4),'N data'!$N$1:$BG$133,5,FALSE),\"\")","v":""},{"$f":"IFERROR(VLOOKUP(CONCATENATE('1.1 Sammanvägd nulägesanalys'!$B16,'1.1 Sammanvägd nulägesanalys'!$G$4),'N data'!$N$1:$BG$133,2,FALSE),\"\")","v":""},{"$f":"IFERROR(VLOOKUP(CONCATENATE('1.1 Sammanvägd nulägesanalys'!$B16,'1.1 Sammanvägd nulägesanalys'!$G$4),'N data'!$N$1:$BG$133,5,FALSE),\"\")","v":""}]
[null,"\nFokusområde 2: Tillförlitliga och säkra system och processer ",null,null,null,null,null,null,null,null,null,null,null,null,null,null,null,{"$f":"CONCATENATE($B17,C$4)","v":"\nFokusområde 2: Tillförlitliga och säkra system och processer A. Tillräcklig kunskap?"},{"$f":"CONCATENATE($B17,E$4)","v":"\nFokusområde 2: Tillförlitliga och säkra system och processer B. Tillräckliga stöd?"},{"$f":"CONCATENATE($B17,G$4)","v":"\nFokusområde 2: Tillförlitliga och säkra system och processer C. Används kunskap och stöd?"}]
[null,"Tillförlitliga och säkra vårdprocesser och rutiner som omfattar patientens väg i hälso- och sjukvården",{"$f":"IFERROR(VLOOKUP(CONCATENATE('1.1 Sammanvägd nulägesanalys'!$B18,'1.1 Sammanvägd nulägesanalys'!$C$4),'N data'!$N$1:$BG$133,2,FALSE),\"\")","v":""},{"$f":"IFERROR(VLOOKUP(CONCATENATE('1.1 Sammanvägd nulägesanalys'!$B18,'1.1 Sammanvägd nulägesanalys'!$C$4),'N data'!$N$1:$BG$133,5,FALSE),\"\")","v":""},{"$f":"IFERROR(VLOOKUP(CONCATENATE('1.1 Sammanvägd nulägesanalys'!$B18,'1.1 Sammanvägd nulägesanalys'!$E$4),'N data'!$N$1:$BG$133,2,FALSE),\"\")","v":""},{"$f":"IFERROR(VLOOKUP(CONCATENATE('1.1 Sammanvägd nulägesanalys'!$B18,'1.1 Sammanvägd nulägesanalys'!$E$4),'N data'!$N$1:$BG$133,5,FALSE),\"\")","v":""},{"$f":"IFERROR(VLOOKUP(CONCATENATE('1.1 Sammanvägd nulägesanalys'!$B18,'1.1 Sammanvägd nulägesanalys'!$G$4),'N data'!$N$1:$BG$133,2,FALSE),\"\")","v":""},{"$f":"IFERROR(VLOOKUP(CONCATENATE('1.1 Sammanvägd nulägesanalys'!$B18,'1.1 Sammanvägd nulägesanalys'!$G$4),'N data'!$N$1:$BG$133,5,FALSE),\"\")","v":""},null,null,null,null,null,null,null,null,null,"Tillförlitliga och säkra vårdprocesser och rutiner som omfattar patientens väg i hälso- och sjukvårdenA. Tillräcklig kunskap?","Tillförlitliga och säkra vårdprocesser och rutiner som omfattar patientens väg i hälso- och sjukvårdenB. Tillräckliga stöd?","Tillförlitliga och säkra vårdprocesser och rutiner som omfattar patientens väg i hälso- och sjukvårdenC. Används kunskap och stöd?"]
[null,"Kunskapsbaserade verktyg, metoder och arbetssätt för ett patientsäkert arbete",{"$f":"IFERROR(VLOOKUP(CONCATENATE('1.1 Sammanvägd nulägesanalys'!$B19,'1.1 Sammanvägd nulägesanalys'!$C$4),'N data'!$N$1:$BG$133,2,FALSE),\"\")","v":""},{"$f":"IFERROR(VLOOKUP(CONCATENATE('1.1 Sammanvägd nulägesanalys'!$B19,'1.1 Sammanvägd nulägesanalys'!$C$4),'N data'!$N$1:$BG$133,5,FALSE),\"\")","v":""},{"$f":"IFERROR(VLOOKUP(CONCATENATE('1.1 Sammanvägd nulägesanalys'!$B19,'1.1 Sammanvägd nulägesanalys'!$E$4),'N data'!$N$1:$BG$133,2,FALSE),\"\")","v":""},{"$f":"IFERROR(VLOOKUP(CONCATENATE('1.1 Sammanvägd nulägesanalys'!$B19,'1.1 Sammanvägd nulägesanalys'!$E$4),'N data'!$N$1:$BG$133,5,FALSE),\"\")","v":""},{"$f":"IFERROR(VLOOKUP(CONCATENATE('1.1 Sammanvägd nulägesanalys'!$B19,'1.1 Sammanvägd nulägesanalys'!$G$4),'N data'!$N$1:$BG$133,2,FALSE),\"\")","v":""},{"$f":"IFERROR(VLOOKUP(CONCATENATE('1.1 Sammanvägd nulägesanalys'!$B19,'1.1 Sammanvägd nulägesanalys'!$G$4),'N data'!$N$1:$BG$133,5,FALSE),\"\")","v":""},null,null,null,null,null,null,null,null,null,"Kunskapsbaserade verktyg, metoder och arbetssätt för ett patientsäkert arbeteA. Tillräcklig kunskap?","Kunskapsbaserade verktyg, metoder och arbetssätt för ett patientsäkert arbeteB. Tillräckliga stöd?","Kunskapsbaserade verktyg, metoder och arbetssätt för ett patientsäkert arbeteC. Används kunskap och stöd?"]
[null,"Medicinteknik, medicintekniska produkter, hjälpmedel och välfärdsteknik",{"$f":"IFERROR(VLOOKUP(CONCATENATE('1.1 Sammanvägd nulägesanalys'!$B20,'1.1 Sammanvägd nulägesanalys'!$C$4),'N data'!$N$1:$BG$133,2,FALSE),\"\")","v":""},{"$f":"IFERROR(VLOOKUP(CONCATENATE('1.1 Sammanvägd nulägesanalys'!$B20,'1.1 Sammanvägd nulägesanalys'!$C$4),'N data'!$N$1:$BG$133,5,FALSE),\"\")","v":""},{"$f":"IFERROR(VLOOKUP(CONCATENATE('1.1 Sammanvägd nulägesanalys'!$B20,'1.1 Sammanvägd nulägesanalys'!$E$4),'N data'!$N$1:$BG$133,2,FALSE),\"\")","v":""},{"$f":"IFERROR(VLOOKUP(CONCATENATE('1.1 Sammanvägd nulägesanalys'!$B20,'1.1 Sammanvägd nulägesanalys'!$E$4),'N data'!$N$1:$BG$133,5,FALSE),\"\")","v":""},{"$f":"IFERROR(VLOOKUP(CONCATENATE('1.1 Sammanvägd nulägesanalys'!$B20,'1.1 Sammanvägd nulägesanalys'!$G$4),'N data'!$N$1:$BG$133,2,FALSE),\"\")","v":""},{"$f":"IFERROR(VLOOKUP(CONCATENATE('1.1 Sammanvägd nulägesanalys'!$B20,'1.1 Sammanvägd nulägesanalys'!$G$4),'N data'!$N$1:$BG$133,5,FALSE),\"\")","v":""},null,null,null,null,null,null,null,null,null,"Medicinteknik, medicintekniska produkter, hjälpmedel och välfärdsteknikA. Tillräcklig kunskap?","Medicinteknik, medicintekniska produkter, hjälpmedel och välfärdsteknikB. Tillräckliga stöd?","Medicinteknik, medicintekniska produkter, hjälpmedel och välfärdsteknikC. Används kunskap och stöd?"]
[null,"\nFokusområde 3: Säker vård här och nu",null,null,null,null,null,null,null,null,null,null,null,null,null,null,null,"\nFokusområde 3: Säker vård här och nuA. Tillräcklig kunskap?","\nFokusområde 3: Säker vård här och nuB. Tillräckliga stöd?","\nFokusområde 3: Säker vård här och nuC. Används kunskap och stöd?"]
[null,"Förmåga att förutse variationer och störningar i närtid",{"$f":"IFERROR(VLOOKUP(CONCATENATE('1.1 Sammanvägd nulägesanalys'!$B22,'1.1 Sammanvägd nulägesanalys'!$C$4),'N data'!$N$1:$BG$133,2,FALSE),\"\")","v":""},{"$f":"IFERROR(VLOOKUP(CONCATENATE('1.1 Sammanvägd nulägesanalys'!$B22,'1.1 Sammanvägd nulägesanalys'!$C$4),'N data'!$N$1:$BG$133,5,FALSE),\"\")","v":""},{"$f":"IFERROR(VLOOKUP(CONCATENATE('1.1 Sammanvägd nulägesanalys'!$B22,'1.1 Sammanvägd nulägesanalys'!$E$4),'N data'!$N$1:$BG$133,2,FALSE),\"\")","v":""},{"$f":"IFERROR(VLOOKUP(CONCATENATE('1.1 Sammanvägd nulägesanalys'!$B22,'1.1 Sammanvägd nulägesanalys'!$E$4),'N data'!$N$1:$BG$133,5,FALSE),\"\")","v":""},{"$f":"IFERROR(VLOOKUP(CONCATENATE('1.1 Sammanvägd nulägesanalys'!$B22,'1.1 Sammanvägd nulägesanalys'!$G$4),'N data'!$N$1:$BG$133,2,FALSE),\"\")","v":""},{"$f":"IFERROR(VLOOKUP(CONCATENATE('1.1 Sammanvägd nulägesanalys'!$B22,'1.1 Sammanvägd nulägesanalys'!$G$4),'N data'!$N$1:$BG$133,5,FALSE),\"\")","v":""},null,null,null,null,null,null,null,null,null,"Förmåga att förutse variationer och störningar i närtidA. Tillräcklig kunskap?","Förmåga att förutse variationer och störningar i närtidB. Tillräckliga stöd?","Förmåga att förutse variationer och störningar i närtidC. Används kunskap och stöd?"]
[null,"Situationsanpassning",{"$f":"IFERROR(VLOOKUP(CONCATENATE('1.1 Sammanvägd nulägesanalys'!$B23,'1.1 Sammanvägd nulägesanalys'!$C$4),'N data'!$N$1:$BG$133,2,FALSE),\"\")","v":""},{"$f":"IFERROR(VLOOKUP(CONCATENATE('1.1 Sammanvägd nulägesanalys'!$B23,'1.1 Sammanvägd nulägesanalys'!$C$4),'N data'!$N$1:$BG$133,5,FALSE),\"\")","v":""},{"$f":"IFERROR(VLOOKUP(CONCATENATE('1.1 Sammanvägd nulägesanalys'!$B23,'1.1 Sammanvägd nulägesanalys'!$E$4),'N data'!$N$1:$BG$133,2,FALSE),\"\")","v":""},{"$f":"IFERROR(VLOOKUP(CONCATENATE('1.1 Sammanvägd nulägesanalys'!$B23,'1.1 Sammanvägd nulägesanalys'!$E$4),'N data'!$N$1:$BG$133,5,FALSE),\"\")","v":""},{"$f":"IFERROR(VLOOKUP(CONCATENATE('1.1 Sammanvägd nulägesanalys'!$B23,'1.1 Sammanvägd nulägesanalys'!$G$4),'N data'!$N$1:$BG$133,2,FALSE),\"\")","v":""},{"$f":"IFERROR(VLOOKUP(CONCATENATE('1.1 Sammanvägd nulägesanalys'!$B23,'1.1 Sammanvägd nulägesanalys'!$G$4),'N data'!$N$1:$BG$133,5,FALSE),\"\")","v":""},null,null,null,null,null,null,null,null,null,"SituationsanpassningA. Tillräcklig kunskap?","SituationsanpassningB. Tillräckliga stöd?","SituationsanpassningC. Används kunskap och stöd?"]
[null,"\nFokusområde 4: Stärka analys, lärande och utveckling",null,null,null,null,null,null,null,null,null,null,null,null,null,null,null,"\nFokusområde 4: Stärka analys, lärande och utvecklingA. Tillräcklig kunskap?","\nFokusområde 4: Stärka analys, lärande och utvecklingB. Tillräckliga stöd?","\nFokusområde 4: Stärka analys, lärande och utvecklingC. Används kunskap och stöd?"]
[null,"Uppföljning av patientsäkerheten genom insamling och sammanställnig av data från flera källor",{"$f":"IFERROR(VLOOKUP(CONCATENATE('1.1 Sammanvägd nulägesanalys'!$B25,'1.1 Sammanvägd nulägesanalys'!$C$4),'N data'!$N$1:$BG$133,2,FALSE),\"\")","v":""},{"$f":"IFERROR(VLOOKUP(CONCATENATE('1.1 Sammanvägd nulägesanalys'!$B25,'1.1 Sammanvägd nulägesanalys'!$C$4),'N data'!$N$1:$BG$133,5,FALSE),\"\")","v":""},{"$f":"IFERROR(VLOOKUP(CONCATENATE('1.1 Sammanvägd nulägesanalys'!$B25,'1.1 Sammanvägd nulägesanalys'!$E$4),'N data'!$N$1:$BG$133,2,FALSE),\"\")","v":""},{"$f":"IFERROR(VLOOKUP(CONCATENATE('1.1 Sammanvägd nulägesanalys'!$B25,'1.1 Sammanvägd nulägesanalys'!$E$4),'N data'!$N$1:$BG$133,5,FALSE),\"\")","v":""},{"$f":"IFERROR(VLOOKUP(CONCATENATE('1.1 Sammanvägd nulägesanalys'!$B25,'1.1 Sammanvägd nulägesanalys'!$G$4),'N data'!$N$1:$BG$133,2,FALSE),\"\")","v":""},{"$f":"IFERROR(VLOOKUP(CONCATENATE('1.1 Sammanvägd nulägesanalys'!$B25,'1.1 Sammanvägd nulägesanalys'!$G$4),'N data'!$N$1:$BG$133,5,FALSE),\"\")","v":""},null,null,null,null,null,null,null,null,null,"Uppföljning av patientsäkerheten genom insamling och sammanställnig av data från flera källorA. Tillräcklig kunskap?","Uppföljning av patientsäkerheten genom insamling och sammanställnig av data från flera källorB. Tillräckliga stöd?","Uppföljning av patientsäkerheten genom insamling och sammanställnig av data från flera källorC. Används kunskap och stöd?"]
[null,"Analyser som möjliggör lärande",{"$f":"IFERROR(VLOOKUP(CONCATENATE('1.1 Sammanvägd nulägesanalys'!$B26,'1.1 Sammanvägd nulägesanalys'!$C$4),'N data'!$N$1:$BG$133,2,FALSE),\"\")","v":""},{"$f":"IFERROR(VLOOKUP(CONCATENATE('1.1 Sammanvägd nulägesanalys'!$B26,'1.1 Sammanvägd nulägesanalys'!$C$4),'N data'!$N$1:$BG$133,5,FALSE),\"\")","v":""},{"$f":"IFERROR(VLOOKUP(CONCATENATE('1.1 Sammanvägd nulägesanalys'!$B26,'1.1 Sammanvägd nulägesanalys'!$E$4),'N data'!$N$1:$BG$133,2,FALSE),\"\")","v":""},{"$f":"IFERROR(VLOOKUP(CONCATENATE('1.1 Sammanvägd nulägesanalys'!$B26,'1.1 Sammanvägd nulägesanalys'!$E$4),'N data'!$N$1:$BG$133,5,FALSE),\"\")","v":""},{"$f":"IFERROR(VLOOKUP(CONCATENATE('1.1 Sammanvägd nulägesanalys'!$B26,'1.1 Sammanvägd nulägesanalys'!$G$4),'N data'!$N$1:$BG$133,2,FALSE),\"\")","v":""},{"$f":"IFERROR(VLOOKUP(CONCATENATE('1.1 Sammanvägd nulägesanalys'!$B26,'1.1 Sammanvägd nulägesanalys'!$G$4),'N data'!$N$1:$BG$133,5,FALSE),\"\")","v":""},null,null,null,null,null,null,null,null,null,"Analyser som möjliggör lärandeA. Tillräcklig kunskap?","Analyser som möjliggör lärandeB. Tillräckliga stöd?","Analyser som möjliggör lärandeC. Används kunskap och stöd?"]
[null,"Lärande från analyser och det egna arbetet",{"$f":"IFERROR(VLOOKUP(CONCATENATE('1.1 Sammanvägd nulägesanalys'!$B27,'1.1 Sammanvägd nulägesanalys'!$C$4),'N data'!$N$1:$BG$133,2,FALSE),\"\")","v":""},{"$f":"IFERROR(VLOOKUP(CONCATENATE('1.1 Sammanvägd nulägesanalys'!$B27,'1.1 Sammanvägd nulägesanalys'!$C$4),'N data'!$N$1:$BG$133,5,FALSE),\"\")","v":""},{"$f":"IFERROR(VLOOKUP(CONCATENATE('1.1 Sammanvägd nulägesanalys'!$B27,'1.1 Sammanvägd nulägesanalys'!$E$4),'N data'!$N$1:$BG$133,2,FALSE),\"\")","v":""},{"$f":"IFERROR(VLOOKUP(CONCATENATE('1.1 Sammanvägd nulägesanalys'!$B27,'1.1 Sammanvägd nulägesanalys'!$E$4),'N data'!$N$1:$BG$133,5,FALSE),\"\")","v":""},{"$f":"IFERROR(VLOOKUP(CONCATENATE('1.1 Sammanvägd nulägesanalys'!$B27,'1.1 Sammanvägd nulägesanalys'!$G$4),'N data'!$N$1:$BG$133,2,FALSE),\"\")","v":""},{"$f":"IFERROR(VLOOKUP(CONCATENATE('1.1 Sammanvägd nulägesanalys'!$B27,'1.1 Sammanvägd nulägesanalys'!$G$4),'N data'!$N$1:$BG$133,5,FALSE),\"\")","v":""},null,null,null,null,null,null,null,null,null,"Lärande från analyser och det egna arbetetA. Tillräcklig kunskap?","Lärande från analyser och det egna arbetetB. Tillräckliga stöd?","Lärande från analyser och det egna arbetetC. Används kunskap och stöd?"]
[null,"Spridning av kunskap och lärdomar",{"$f":"IFERROR(VLOOKUP(CONCATENATE('1.1 Sammanvägd nulägesanalys'!$B28,'1.1 Sammanvägd nulägesanalys'!$C$4),'N data'!$N$1:$BG$133,2,FALSE),\"\")","v":""},{"$f":"IFERROR(VLOOKUP(CONCATENATE('1.1 Sammanvägd nulägesanalys'!$B28,'1.1 Sammanvägd nulägesanalys'!$C$4),'N data'!$N$1:$BG$133,5,FALSE),\"\")","v":""},{"$f":"IFERROR(VLOOKUP(CONCATENATE('1.1 Sammanvägd nulägesanalys'!$B28,'1.1 Sammanvägd nulägesanalys'!$E$4),'N data'!$N$1:$BG$133,2,FALSE),\"\")","v":""},{"$f":"IFERROR(VLOOKUP(CONCATENATE('1.1 Sammanvägd nulägesanalys'!$B28,'1.1 Sammanvägd nulägesanalys'!$E$4),'N data'!$N$1:$BG$133,5,FALSE),\"\")","v":""},{"$f":"IFERROR(VLOOKUP(CONCATENATE('1.1 Sammanvägd nulägesanalys'!$B28,'1.1 Sammanvägd nulägesanalys'!$G$4),'N data'!$N$1:$BG$133,2,FALSE),\"\")","v":""},{"$f":"IFERROR(VLOOKUP(CONCATENATE('1.1 Sammanvägd nulägesanalys'!$B28,'1.1 Sammanvägd nulägesanalys'!$G$4),'N data'!$N$1:$BG$133,5,FALSE),\"\")","v":""},null,null,null,null,null,null,null,null,null,"Spridning av kunskap och lärdomarA. Tillräcklig kunskap?","Spridning av kunskap och lärdomarB. Tillräckliga stöd?","Spridning av kunskap och lärdomarC. Används kunskap och stöd?"]
[null,"\nFokusområde 5: Öka riskmedvetenhet och beredskap",null,null,null,null,null,null,null,null,null,null,null,null,null,null,null,"\nFokusområde 5: Öka riskmedvetenhet och beredskapA. Tillräcklig kunskap?","\nFokusområde 5: Öka riskmedvetenhet och beredskapB. Tillräckliga stöd?","\nFokusområde 5: Öka riskmedvetenhet och beredskapC. Används kunskap och stöd?"]
[null,"Riskkontroll",{"$f":"IFERROR(VLOOKUP(CONCATENATE('1.1 Sammanvägd nulägesanalys'!$B30,'1.1 Sammanvägd nulägesanalys'!$C$4),'N data'!$N$1:$BG$133,2,FALSE),\"\")","v":""},{"$f":"IFERROR(VLOOKUP(CONCATENATE('1.1 Sammanvägd nulägesanalys'!$B30,'1.1 Sammanvägd nulägesanalys'!$C$4),'N data'!$N$1:$BG$133,5,FALSE),\"\")","v":""},{"$f":"IFERROR(VLOOKUP(CONCATENATE('1.1 Sammanvägd nulägesanalys'!$B30,'1.1 Sammanvägd nulägesanalys'!$E$4),'N data'!$N$1:$BG$133,2,FALSE),\"\")","v":""},{"$f":"IFERROR(VLOOKUP(CONCATENATE('1.1 Sammanvägd nulägesanalys'!$B30,'1.1 Sammanvägd nulägesanalys'!$E$4),'N data'!$N$1:$BG$133,5,FALSE),\"\")","v":""},{"$f":"IFERROR(VLOOKUP(CONCATENATE('1.1 Sammanvägd nulägesanalys'!$B30,'1.1 Sammanvägd nulägesanalys'!$G$4),'N data'!$N$1:$BG$133,2,FALSE),\"\")","v":""},{"$f":"IFERROR(VLOOKUP(CONCATENATE('1.1 Sammanvägd nulägesanalys'!$B30,'1.1 Sammanvägd nulägesanalys'!$G$4),'N data'!$N$1:$BG$133,5,FALSE),\"\")","v":""},null,null,null,null,null,null,null,null,null,"RiskkontrollA. Tillräcklig kunskap?","RiskkontrollB. Tillräckliga stöd?","RiskkontrollC. Används kunskap och stöd?"]
[null,"Färdighetsträning och simulering för ökad beredskap",{"$f":"IFERROR(VLOOKUP(CONCATENATE('1.1 Sammanvägd nulägesanalys'!$B31,'1.1 Sammanvägd nulägesanalys'!$C$4),'N data'!$N$1:$BG$133,2,FALSE),\"\")","v":""},{"$f":"IFERROR(VLOOKUP(CONCATENATE('1.1 Sammanvägd nulägesanalys'!$B31,'1.1 Sammanvägd nulägesanalys'!$C$4),'N data'!$N$1:$BG$133,5,FALSE),\"\")","v":""},{"$f":"IFERROR(VLOOKUP(CONCATENATE('1.1 Sammanvägd nulägesanalys'!$B31,'1.1 Sammanvägd nulägesanalys'!$E$4),'N data'!$N$1:$BG$133,2,FALSE),\"\")","v":""},{"$f":"IFERROR(VLOOKUP(CONCATENATE('1.1 Sammanvägd nulägesanalys'!$B31,'1.1 Sammanvägd nulägesanalys'!$E$4),'N data'!$N$1:$BG$133,5,FALSE),\"\")","v":""},{"$f":"IFERROR(VLOOKUP(CONCATENATE('1.1 Sammanvägd nulägesanalys'!$B31,'1.1 Sammanvägd nulägesanalys'!$G$4),'N data'!$N$1:$BG$133,2,FALSE),\"\")","v":""},{"$f":"IFERROR(VLOOKUP(CONCATENATE('1.1 Sammanvägd nulägesanalys'!$B31,'1.1 Sammanvägd nulägesanalys'!$G$4),'N data'!$N$1:$BG$133,5,FALSE),\"\")","v":""},null,null,null,null,null,null,null,null,null,"Färdighetsträning och simulering för ökad beredskapA. Tillräcklig kunskap?","Färdighetsträning och simulering för ökad beredskapB. Tillräckliga stöd?","Färdighetsträning och simulering för ökad beredskapC. Används kunskap och stöd?"]
[null,"Beredskap och planering för hantering av risker på lång sikt",{"$f":"IFERROR(VLOOKUP(CONCATENATE('1.1 Sammanvägd nulägesanalys'!$B32,'1.1 Sammanvägd nulägesanalys'!$C$4),'N data'!$N$1:$BG$133,2,FALSE),\"\")","v":""},{"$f":"IFERROR(VLOOKUP(CONCATENATE('1.1 Sammanvägd nulägesanalys'!$B32,'1.1 Sammanvägd nulägesanalys'!$C$4),'N data'!$N$1:$BG$133,5,FALSE),\"\")","v":""},{"$f":"IFERROR(VLOOKUP(CONCATENATE('1.1 Sammanvägd nulägesanalys'!$B32,'1.1 Sammanvägd nulägesanalys'!$E$4),'N data'!$N$1:$BG$133,2,FALSE),\"\")","v":""},{"$f":"IFERROR(VLOOKUP(CONCATENATE('1.1 Sammanvägd nulägesanalys'!$B32,'1.1 Sammanvägd nulägesanalys'!$E$4),'N data'!$N$1:$BG$133,5,FALSE),\"\")","v":""},{"$f":"IFERROR(VLOOKUP(CONCATENATE('1.1 Sammanvägd nulägesanalys'!$B32,'1.1 Sammanvägd nulägesanalys'!$G$4),'N data'!$N$1:$BG$133,2,FALSE),\"\")","v":""},{"$f":"IFERROR(VLOOKUP(CONCATENATE('1.1 Sammanvägd nulägesanalys'!$B32,'1.1 Sammanvägd nulägesanalys'!$G$4),'N data'!$N$1:$BG$133,5,FALSE),\"\")","v":""},null,null,null,null,null,null,null,null,null,"Beredskap och planering för hantering av risker på lång siktA. Tillräcklig kunskap?","Beredskap och planering för hantering av risker på lång siktB. Tillräckliga stöd?","Beredskap och planering för hantering av risker på lång siktC. Används kunskap och stöd?"]
[null,"Omvärldsbevakning ur ett patientsäkerhetsperspektiv",{"$f":"IFERROR(VLOOKUP(CONCATENATE('1.1 Sammanvägd nulägesanalys'!$B33,'1.1 Sammanvägd nulägesanalys'!$C$4),'N data'!$N$1:$BG$133,2,FALSE),\"\")","v":""},{"$f":"IFERROR(VLOOKUP(CONCATENATE('1.1 Sammanvägd nulägesanalys'!$B33,'1.1 Sammanvägd nulägesanalys'!$C$4),'N data'!$N$1:$BG$133,5,FALSE),\"\")","v":""},{"$f":"IFERROR(VLOOKUP(CONCATENATE('1.1 Sammanvägd nulägesanalys'!$B33,'1.1 Sammanvägd nulägesanalys'!$E$4),'N data'!$N$1:$BG$133,2,FALSE),\"\")","v":""},{"$f":"IFERROR(VLOOKUP(CONCATENATE('1.1 Sammanvägd nulägesanalys'!$B33,'1.1 Sammanvägd nulägesanalys'!$E$4),'N data'!$N$1:$BG$133,5,FALSE),\"\")","v":""},{"$f":"IFERROR(VLOOKUP(CONCATENATE('1.1 Sammanvägd nulägesanalys'!$B33,'1.1 Sammanvägd nulägesanalys'!$G$4),'N data'!$N$1:$BG$133,2,FALSE),\"\")","v":""},{"$f":"IFERROR(VLOOKUP(CONCATENATE('1.1 Sammanvägd nulägesanalys'!$B33,'1.1 Sammanvägd nulägesanalys'!$G$4),'N data'!$N$1:$BG$133,5,FALSE),\"\")","v":""},null,null,null,null,null,null,null,null,null,"Omvärldsbevakning ur ett patientsäkerhetsperspektivA. Tillräcklig kunskap?","Omvärldsbevakning ur ett patientsäkerhetsperspektivB. Tillräckliga stöd?","Omvärldsbevakning ur ett patientsäkerhetsperspektivC. Används kunskap och stöd?"]

{"sheet":"1.2 Nulägesöversikt","index":6,"n_rows":56,"n_cols":19,"rows_kept":56,"cut":false,"hidden":false,"merged":[[2,2,2,5],[1,2,1,5],[4,1,4,2],[1,7,5,8]]}
[null,null,null,null,null,null,null,null,null,null,null,null,null,null,"Aktuell lista","Listkolumn","Aktuell listlängd"]
[null,"Välj fokusområde / grundläggande förutsättning",null,null,null,null,null,"Information: På denna sida kan ni se resultatet från var och en av de genomförda nulägesanalyserna för ett tema i taget.\n\n1. Välj först fokusområde eller grundläggande förutsättning i den översta rullistan.\n2. Välj därefter tema. Obs! Det kan dröja ca 10 sekunder innan alternativen dyker upp.",null,null,null,null,null,"Grundläggande förutsättningar för patientsäkerhetsarbete",{"$f":"HLOOKUP(C2,$N$12:$T$13,2,FALSE)","v":{"$error":"#N/A"}},{"$f":"O2-1","v":{"$error":"#N/A"}},{"$f":"COUNTIF(OFFSET($N$13:$N$27,0,P2),\">\"\"\")","v":{"$error":"#N/A"}}]
[null,"Tema",null,null,null,null,null,null,null,null,null,null,null,"Fokusområde 1: Öka kunskap om inträffade vårdskador"]
[null,null,null,null,null,null,null,null,null,null,null,null,null,"Fokusområde 2: Tillförlitliga och säkra system och processer "]
[null,"Tips! Om delar av en beskrivning av utmaningar, hinder och möjliggörare är dold går det bra att bredda raderna genom att i vänstermarginalen dubbelklicka på strecket mellan raderna.",null,null,null,null,null,null,null,null,null,null,null,"Fokusområde 3: Säker vård här och nu"]
[null,null,null,null,null,null,null,null,null,null,null,null,null,"Fokusområde 4: Stärka analys, lärande och utveckling"]
[null,"Svarande","A. Tillräcklig kunskap?","B. Tillräckliga stöd?","C. Används kunskap och stöd?","D. Beskrivning av utmaningar, hinder och möjliggörare",null,null,null,null,null,null,"kolumn","Fokusområde 5: Öka riskmedvetenhet och beredskap"]
[null,{"$f":"IF('N data'!D9=\"\",\"\",'N data'!D9)","v":""},{"$f":"IFERROR(VLOOKUP(CONCATENATE($C$3,C$7),'N data'!$N$1:$BG$133,$M8,FALSE),\"\")","v":""},{"$f":"IFERROR(VLOOKUP(CONCATENATE($C$3,D$7),'N data'!$N$1:$BG$133,$M8,FALSE),\"\")","v":""},{"$f":"IFERROR(VLOOKUP(CONCATENATE($C$3,E$7),'N data'!$N$1:$BG$133,$M8,FALSE),\"\")","v":""},{"$f":"IFERROR(VLOOKUP(CONCATENATE($C$3,F$7),'N data'!$N$1:$BG$133,$M8,FALSE),\"\")","v":""},{"$f":"IFERROR(VLOOKUP(CONCATENATE($C$3,G$7),'N data'!$N$1:$BG$133,$M8,FALSE),\"\")","v":""},null,null,null,null,"N1",7]
[null,{"$f":"IF('N data'!D10=\"\",\"\",'N data'!D10)","v":""},{"$f":"IFERROR(VLOOKUP(CONCATENATE($C$3,C$7),'N data'!$N$1:$BG$133,$M9,FALSE),\"\")","v":""},{"$f":"IFERROR(VLOOKUP(CONCATENATE($C$3,D$7),'N data'!$N$1:$BG$133,$M9,FALSE),\"\")","v":""},{"$f":"IFERROR(VLOOKUP(CONCATENATE($C$3,E$7),'N data'!$N$1:$BG$133,$M9,FALSE),\"\")","v":""},{"$f":"IFERROR(VLOOKUP(CONCATENATE($C$3,F$7),'N data'!$N$1:$BG$133,$M9,FALSE),\"\")","v":""},null,null,null,null,null,"N2",8]
[null,{"$f":"IF('N data'!D11=\"\",\"\",'N data'!D11)","v":""},{"$f":"IFERROR(VLOOKUP(CONCATENATE($C$3,C$7),'N data'!$N$1:$BG$133,$M10,FALSE),\"\")","v":""},{"$f":"IFERROR(VLOOKUP(CONCATENATE($C$3,D$7),'N data'!$N$1:$BG$133,$M10,FALSE),\"\")","v":""},{"$f":"IFERROR(VLOOKUP(CONCATENATE($C$3,E$7),'N data'!$N$1:$BG$133,$M10,FALSE),\"\")","v":""},{"$f":"IFERROR(VLOOKUP(CONCATENATE($C$3,F$7),'N data'!$N$1:$BG$133,$M10,FALSE),\"\")","v":""},null,null,null,null,null,"N3",9]
[null,{"$f":"IF('N data'!D12=\"\",\"\",'N data'!D12)","v":""},{"$f":"IFERROR(VLOOKUP(CONCATENATE($C$3,C$7),'N data'!$N$1:$BG$133,$M11,FALSE),\"\")","v":""},{"$f":"IFERROR(VLOOKUP(CONCATENATE($C$3,D$7),'N data'!$N$1:$BG$133,$M11,FALSE),\"\")","v":""},{"$f":"IFERROR(VLOOKUP(CONCATENATE($C$3,E$7),'N data'!$N$1:$BG$133,$M11,FALSE),\"\")","v":""},{"$f":"IFERROR(VLOOKUP(CONCATENATE($C$3,F$7),'N data'!$N$1:$BG$133,$M11,FALSE),\"\")","v":""},null,null,null,null,null,"N4",10]
[null,{"$f":"IF('N data'!D13=\"\",\"\",'N data'!D13)","v":""},{"$f":"IFERROR(VLOOKUP(CONCATENATE($C$3,C$7),'N data'!$N$1:$BG$133,$M12,FALSE),\"\")","v":""},{"$f":"IFERROR(VLOOKUP(CONCATENATE($C$3,D$7),'N data'!$N$1:$BG$133,$M12,FALSE),\"\")","v":""},{"$f":"IFERROR(VLOOKUP(CONCATENATE($C$3,E$7),'N data'!$N$1:$BG$133,$M12,FALSE),\"\")","v":""},{"$f":"IFERROR(VLOOKUP(CONCATENATE($C$3,F$7),'N data'!$N$1:$BG$133,$M12,FALSE),\"\")","v":""},null,null,null,null,null,"N5",11,"Grundläggande förutsättningar för patientsäkerhetsarbete","Fokusområde 1: Öka kunskap om inträffade vårdskador","Fokusområde 2: Tillförlitliga och säkra system och processer ","Fokusområde 3: Säker vård här och nu","Fokusområde 4: Stärka analys, lärande och utveckling","Fokusområde 5: Öka riskmedvetenhet och beredskap"]
[null,{"$f":"IF('N data'!D14=\"\",\"\",'N data'!D14)","v":""},{"$f":"IFERROR(VLOOKUP(CONCATENATE($C$3,C$7),'N data'!$N$1:$BG$133,$M13,FALSE),\"\")","v":""},{"$f":"IFERROR(VLOOKUP(CONCATENATE($C$3,D$7),'N data'!$N$1:$BG$133,$M13,FALSE),\"\")","v":""},{"$f":"IFERROR(VLOOKUP(CONCATENATE($C$3,E$7),'N data'!$N$1:$BG$133,$M13,FALSE),\"\")","v":""},{"$f":"IFERROR(VLOOKUP(CONCATENATE($C$3,F$7),'N data'!$N$1:$BG$133,$M13,FALSE),\"\")","v":""},null,null,null,null,null,"N6",12,1,2,3,4,5,6]
[null,{"$f":"IF('N data'!D15=\"\",\"\",'N data'!D15)","v":""},{"$f":"IFERROR(VLOOKUP(CONCATENATE($C$3,C$7),'N data'!$N$1:$BG$133,$M14,FALSE),\"\")","v":""},{"$f":"IFERROR(VLOOKUP(CONCATENATE($C$3,D$7),'N data'!$N$1:$BG$133,$M14,FALSE),\"\")","v":""},{"$f":"IFERROR(VLOOKUP(CONCATENATE($C$3,E$7),'N data'!$N$1:$BG$133,$M14,FALSE),\"\")","v":""},{"$f":"IFERROR(VLOOKUP(CONCATENATE($C$3,F$7),'N data'!$N$1:$BG$133,$M14,FALSE),\"\")","v":""},null,null,null,null,null,"N7",13,{"$f":"'1.1 Sammanvägd nulägesanalys'!B7","v":"En god säkerhetskultur"},{"$f":"'1.1 Sammanvägd nulägesanalys'!B15","v":"Identifiering, sammanställning och aggregering av information om vårdskador"},{"$f":"'1.1 Sammanvägd nulägesanalys'!B18","v":"Tillförlitliga och säkra vårdprocesser och rutiner som omfattar patientens väg i hälso- och sjukvården"},{"$f":"'1.1 Sammanvägd nulägesanalys'!B22","v":"Förmåga att förutse variationer och störningar i närtid"},{"$f":"'1.1 Sammanvägd nulägesanalys'!B25","v":"Uppföljning av patientsäkerheten genom insamling och sammanställnig av data från flera källor"},{"$f":"'1.1 Sammanvägd nulägesanalys'!B30","v":"Riskkontroll"}]
[null,{"$f":"IF('N data'!D16=\"\",\"\",'N data'!D16)","v":""},{"$f":"IFERROR(VLOOKUP(CONCATENATE($C$3,C$7),'N data'!$N$1:$BG$133,$M15,FALSE),\"\")","v":""},{"$f":"IFERROR(VLOOKUP(CONCATENATE($C$3,D$7),'N data'!$N$1:$BG$133,$M15,FALSE),\"\")","v":""},{"$f":"IFERROR(VLOOKUP(CONCATENATE($C$3,E$7),'N data'!$N$1:$BG$133,$M15,FALSE),\"\")","v":""},{"$f":"IFERROR(VLOOKUP(CONCATENATE($C$3,F$7),'N data'!$N$1:$BG$133,$M15,FALSE),\"\")","v":""},null,null,null,null,null,"N8",14,{"$f":"'1.1 Sammanvägd nulägesanalys'!B8","v":"Adekvat kunskap och kompetens"},{"$f":"'1.1 Sammanvägd nulägesanalys'!B16","v":"Minimering av effekter av negativa händelser"},{"$f":"'1.1 Sammanvägd nulägesanalys'!B19","v":"Kunskapsbaserade verktyg, metoder och arbetssätt för ett patientsäkert arbete"},{"$f":"'1.1 Sammanvägd nulägesanalys'!B23","v":"Situationsanpassning"},{"$f":"'1.1 Sammanvägd nulägesanalys'!B26","v":"Analyser som möjliggör lärande"},{"$f":"'1.1 Sammanvägd nulägesanalys'!B31","v":"Färdighetsträning och simulering för ökad beredskap"}]
[null,{"$f":"IF('N data'!D17=\"\",\"\",'N data'!D17)","v":""},{"$f":"IFERROR(VLOOKUP(CONCATENATE($C$3,C$7),'N data'!$N$1:$BG$133,$M16,FALSE),\"\")","v":""},{"$f":"IFERROR(VLOOKUP(CONCATENATE($C$3,D$7),'N data'!$N$1:$BG$133,$M16,FALSE),\"\")","v":""},{"$f":"IFERROR(VLOOKUP(CONCATENATE($C$3,E$7),'N data'!$N$1:$BG$133,$M16,FALSE),\"\")","v":""},{"$f":"IFERROR(VLOOKUP(CONCATENATE($C$3,F$7),'N data'!$N$1:$BG$133,$M16,FALSE),\"\")","v":""},null,null,null,null,null,"N9",15,{"$f":"'1.1 Sammanvägd nulägesanalys'!B9","v":"Patienten som medskapare"},null,{"$f":"'1.1 Sammanvägd nulägesanalys'!B20","v":"Medicinteknik, medicintekniska produkter, hjälpmedel och välfärdsteknik"},null,{"$f":"'1.1 Sammanvägd nulägesanalys'!B27","v":"Lärande från analyser och det egna arbetet"},{"$f":"'1.1 Sammanvägd nulägesanalys'!B32","v":"Beredskap och planering för hantering av risker på lång sikt"}]
[null,{"$f":"IF('N data'!D18=\"\",\"\",'N data'!D18)","v":""},{"$f":"IFERROR(VLOOKUP(CONCATENATE($C$3,C$7),'N data'!$N$1:$BG$133,$M17,FALSE),\"\")","v":""},{"$f":"IFERROR(VLOOKUP(CONCATENATE($C$3,D$7),'N data'!$N$1:$BG$133,$M17,FALSE),\"\")","v":""},{"$f":"IFERROR(VLOOKUP(CONCATENATE($C$3,E$7),'N data'!$N$1:$BG$133,$M17,FALSE),\"\")","v":""},{"$f":"IFERROR(VLOOKUP(CONCATENATE($C$3,F$7),'N data'!$N$1:$BG$133,$M17,FALSE),\"\")","v":""},null,null,null,null,null,"N10",16,{"$f":"'1.1 Sammanvägd nulägesanalys'!B10","v":"Patienter och närståendes erfarenheter av vårdskador"},null,null,null,{"$f":"'1.1 Sammanvägd nulägesanalys'!B28","v":"Spridning av kunskap och lärdomar"},{"$f":"'1.1 Sammanvägd nulägesanalys'!B33","v":"Omvärldsbevakning ur ett patientsäkerhetsperspektiv"}]
[null,{"$f":"IF('N data'!D19=\"\",\"\",'N data'!D19)","v":""},{"$f":"IFERROR(VLOOKUP(CONCATENATE($C$3,C$7),'N data'!$N$1:$BG$133,$M18,FALSE),\"\")","v":""},{"$f":"IFERROR(VLOOKUP(CONCATENATE($C$3,D$7),'N data'!$N$1:$BG$133,$M18,FALSE),\"\")","v":""},{"$f":"IFERROR(VLOOKUP(CONCATENATE($C$3,E$7),'N data'!$N$1:$BG$133,$M18,FALSE),\"\")","v":""},{"$f":"IFERROR(VLOOKUP(CONCATENATE($C$3,F$7),'N data'!$N$1:$BG$133,$M18,FALSE),\"\")","v":""},null,null,null,null,null,"N11",17,{"$f":"'1.1 Sammanvägd nulägesanalys'!B11","v":"Patientmedverkan i utveckling av processer och arbetssätt"}]
[null,{"$f":"IF('N data'!D20=\"\",\"\",'N data'!D20)","v":""},{"$f":"IFERROR(VLOOKUP(CONCATENATE($C$3,C$7),'N data'!$N$1:$BG$133,$M19,FALSE),\"\")","v":""},{"$f":"IFERROR(VLOOKUP(CONCATENATE($C$3,D$7),'N data'!$N$1:$BG$133,$M19,FALSE),\"\")","v":""},{"$f":"IFERROR(VLOOKUP(CONCATENATE($C$3,E$7),'N data'!$N$1:$BG$133,$M19,FALSE),\"\")","v":""},{"$f":"IFERROR(VLOOKUP(CONCATENATE($C$3,F$7),'N data'!$N$1:$BG$133,$M19,FALSE),\"\")","v":""},null,null,null,null,null,"N12",18,{"$f":"'1.1 Sammanvägd nulägesanalys'!B12","v":"Patientens delaktighet i den egna vården"}]
[null,{"$f":"IF('N data'!D21=\"\",\"\",'N data'!D21)","v":""},{"$f":"IFERROR(VLOOKUP(CONCATENATE($C$3,C$7),'N data'!$N$1:$BG$133,$M20,FALSE),\"\")","v":""},{"$f":"IFERROR(VLOOKUP(CONCATENATE($C$3,D$7),'N data'!$N$1:$BG$133,$M20,FALSE),\"\")","v":""},{"$f":"IFERROR(VLOOKUP(CONCATENATE($C$3,E$7),'N data'!$N$1:$BG$133,$M20,FALSE),\"\")","v":""},{"$f":"IFERROR(VLOOKUP(CONCATENATE($C$3,F$7),'N data'!$N$1:$BG$133,$M20,FALSE),\"\")","v":""},null,null,null,null,null,"N13",19,{"$f":"'1.1 Sammanvägd nulägesanalys'!B13","v":"Patientmedverkan för ökad riskmedvetenhet och beredskap"}]
[null,{"$f":"IF('N data'!D22=\"\",\"\",'N data'!D22)","v":""},{"$f":"IFERROR(VLOOKUP(CONCATENATE($C$3,C$7),'N data'!$N$1:$BG$133,$M21,FALSE),\"\")","v":""},{"$f":"IFERROR(VLOOKUP(CONCATENATE($C$3,D$7),'N data'!$N$1:$BG$133,$M21,FALSE),\"\")","v":""},{"$f":"IFERROR(VLOOKUP(CONCATENATE($C$3,E$7),'N data'!$N$1:$BG$133,$M21,FALSE),\"\")","v":""},{"$f":"IFERROR(VLOOKUP(CONCATENATE($C$3,F$7),'N data'!$N$1:$BG$133,$M21,FALSE),\"\")","v":""},null,null,null,null,null,"N14",20]
[null,{"$f":"IF('N data'!D23=\"\",\"\",'N data'!D23)","v":""},{"$f":"IFERROR(VLOOKUP(CONCATENATE($C$3,C$7),'N data'!$N$1:$BG$133,$M22,FALSE),\"\")","v":""},{"$f":"IFERROR(VLOOKUP(CONCATENATE($C$3,D$7),'N data'!$N$1:$BG$133,$M22,FALSE),\"\")","v":""},{"$f":"IFERROR(VLOOKUP(CONCATENATE($C$3,E$7),'N data'!$N$1:$BG$133,$M22,FALSE),\"\")","v":""},{"$f":"IFERROR(VLOOKUP(CONCATENATE($C$3,F$7),'N data'!$N$1:$BG$133,$M22,FALSE),\"\")","v":""},null,null,null,null,null,"N15",21]
[null,{"$f":"IF('N data'!D24=\"\",\"\",'N data'!D24)","v":""},{"$f":"IFERROR(VLOOKUP(CONCATENATE($C$3,C$7),'N data'!$N$1:$BG$133,$M23,FALSE),\"\")","v":""},{"$f":"IFERROR(VLOOKUP(CONCATENATE($C$3,D$7),'N data'!$N$1:$BG$133,$M23,FALSE),\"\")","v":""},{"$f":"IFERROR(VLOOKUP(CONCATENATE($C$3,E$7),'N data'!$N$1:$BG$133,$M23,FALSE),\"\")","v":""},{"$f":"IFERROR(VLOOKUP(CONCATENATE($C$3,F$7),'N data'!$N$1:$BG$133,$M23,FALSE),\"\")","v":""},null,null,null,null,null,"N16",22]
[null,{"$f":"IF('N data'!D25=\"\",\"\",'N data'!D25)","v":""},{"$f":"IFERROR(VLOOKUP(CONCATENATE($C$3,C$7),'N data'!$N$1:$BG$133,$M24,FALSE),\"\")","v":""},{"$f":"IFERROR(VLOOKUP(CONCATENATE($C$3,D$7),'N data'!$N$1:$BG$133,$M24,FALSE),\"\")","v":""},{"$f":"IFERROR(VLOOKUP(CONCATENATE($C$3,E$7),'N data'!$N$1:$BG$133,$M24,FALSE),\"\")","v":""},{"$f":"IFERROR(VLOOKUP(CONCATENATE($C$3,F$7),'N data'!$N$1:$BG$133,$M24,FALSE),\"\")","v":""},null,null,null,null,null,"N17",23]
[null,{"$f":"IF('N data'!D26=\"\",\"\",'N data'!D26)","v":""},{"$f":"IFERROR(VLOOKUP(CONCATENATE($C$3,C$7),'N data'!$N$1:$BG$133,$M25,FALSE),\"\")","v":""},{"$f":"IFERROR(VLOOKUP(CONCATENATE($C$3,D$7),'N data'!$N$1:$BG$133,$M25,FALSE),\"\")","v":""},{"$f":"IFERROR(VLOOKUP(CONCATENATE($C$3,E$7),'N data'!$N$1:$BG$133,$M25,FALSE),\"\")","v":""},{"$f":"IFERROR(VLOOKUP(CONCATENATE($C$3,F$7),'N data'!$N$1:$BG$133,$M25,FALSE),\"\")","v":""},null,null,null,null,null,"N18",24]
[null,{"$f":"IF('N data'!D27=\"\",\"\",'N data'!D27)","v":""},{"$f":"IFERROR(VLOOKUP(CONCATENATE($C$3,C$7),'N data'!$N$1:$BG$133,$M26,FALSE),\"\")","v":""},{"$f":"IFERROR(VLOOKUP(CONCATENATE($C$3,D$7),'N data'!$N$1:$BG$133,$M26,FALSE),\"\")","v":""},{"$f":"IFERROR(VLOOKUP(CONCATENATE($C$3,E$7),'N data'!$N$1:$BG$133,$M26,FALSE),\"\")","v":""},{"$f":"IFERROR(VLOOKUP(CONCATENATE($C$3,F$7),'N data'!$N$1:$BG$133,$M26,FALSE),\"\")","v":""},null,null,null,null,null,"N19",25]
[null,{"$f":"IF('N data'!D28=\"\",\"\",'N data'!D28)","v":""},{"$f":"IFERROR(VLOOKUP(CONCATENATE($C$3,C$7),'N data'!$N$1:$BG$133,$M27,FALSE),\"\")","v":""},{"$f":"IFERROR(VLOOKUP(CONCATENATE($C$3,D$7),'N data'!$N$1:$BG$133,$M27,FALSE),\"\")","v":""},{"$f":"IFERROR(VLOOKUP(CONCATENATE($C$3,E$7),'N data'!$N$1:$BG$133,$M27,FALSE),\"\")","v":""},{"$f":"IFERROR(VLOOKUP(CONCATENATE($C$3,F$7),'N data'!$N$1:$BG$133,$M27,FALSE),\"\")","v":""},null,null,null,null,null,"N20",26]
[null,{"$f":"IF('N data'!D29=\"\",\"\",'N data'!D29)","v":""},{"$f":"IFERROR(VLOOKUP(CONCATENATE($C$3,C$7),'N data'!$N$1:$BG$133,$M28,FALSE),\"\")","v":""},{"$f":"IFERROR(VLOOKUP(CONCATENATE($C$3,D$7),'N data'!$N$1:$BG$133,$M28,FALSE),\"\")","v":""},{"$f":"IFERROR(VLOOKUP(CONCATENATE($C$3,E$7),'N data'!$N$1:$BG$133,$M28,FALSE),\"\")","v":""},{"$f":"IFERROR(VLOOKUP(CONCATENATE($C$3,F$7),'N data'!$N$1:$BG$133,$M28,FALSE),\"\")","v":""},null,null,null,null,null,"N21",27]
[null,{"$f":"IF('N data'!D30=\"\",\"\",'N data'!D30)","v":""},{"$f":"IFERROR(VLOOKUP(CONCATENATE($C$3,C$7),'N data'!$N$1:$BG$133,$M29,FALSE),\"\")","v":""},{"$f":"IFERROR(VLOOKUP(CONCATENATE($C$3,D$7),'N data'!$N$1:$BG$133,$M29,FALSE),\"\")","v":""},{"$f":"IFERROR(VLOOKUP(CONCATENATE($C$3,E$7),'N data'!$N$1:$BG$133,$M29,FALSE),\"\")","v":""},{"$f":"IFERROR(VLOOKUP(CONCATENATE($C$3,F$7),'N data'!$N$1:$BG$133,$M29,FALSE),\"\")","v":""},null,null,null,null,null,"N22",28]
[null,{"$f":"IF('N data'!D31=\"\",\"\",'N data'!D31)","v":""},{"$f":"IFERROR(VLOOKUP(CONCATENATE($C$3,C$7),'N data'!$N$1:$BG$133,$M30,FALSE),\"\")","v":""},{"$f":"IFERROR(VLOOKUP(CONCATENATE($C$3,D$7),'N data'!$N$1:$BG$133,$M30,FALSE),\"\")","v":""},{"$f":"IFERROR(VLOOKUP(CONCATENATE($C$3,E$7),'N data'!$N$1:$BG$133,$M30,FALSE),\"\")","v":""},{"$f":"IFERROR(VLOOKUP(CONCATENATE($C$3,F$7),'N data'!$N$1:$BG$133,$M30,FALSE),\"\")","v":""},null,null,null,null,null,"N23",29]
[null,{"$f":"IF('N data'!D32=\"\",\"\",'N data'!D32)","v":""},{"$f":"IFERROR(VLOOKUP(CONCATENATE($C$3,C$7),'N data'!$N$1:$BG$133,$M31,FALSE),\"\")","v":""},{"$f":"IFERROR(VLOOKUP(CONCATENATE($C$3,D$7),'N data'!$N$1:$BG$133,$M31,FALSE),\"\")","v":""},{"$f":"IFERROR(VLOOKUP(CONCATENATE($C$3,E$7),'N data'!$N$1:$BG$133,$M31,FALSE),\"\")","v":""},{"$f":"IFERROR(VLOOKUP(CONCATENATE($C$3,F$7),'N data'!$N$1:$BG$133,$M31,FALSE),\"\")","v":""},null,null,null,null,null,"N24",30]
[null,{"$f":"IF('N data'!D33=\"\",\"\",'N data'!D33)","v":""},{"$f":"IFERROR(VLOOKUP(CONCATENATE($C$3,C$7),'N data'!$N$1:$BG$133,$M32,FALSE),\"\")","v":""},{"$f":"IFERROR(VLOOKUP(CONCATENATE($C$3,D$7),'N data'!$N$1:$BG$133,$M32,FALSE),\"\")","v":""},{"$f":"IFERROR(VLOOKUP(CONCATENATE($C$3,E$7),'N data'!$N$1:$BG$133,$M32,FALSE),\"\")","v":""},{"$f":"IFERROR(VLOOKUP(CONCATENATE($C$3,F$7),'N data'!$N$1:$BG$133,$M32,FALSE),\"\")","v":""},null,null,null,null,null,"N25",31]
[null,{"$f":"IF('N data'!D34=\"\",\"\",'N data'!D34)","v":""},{"$f":"IFERROR(VLOOKUP(CONCATENATE($C$3,C$7),'N data'!$N$1:$BG$133,$M33,FALSE),\"\")","v":""},{"$f":"IFERROR(VLOOKUP(CONCATENATE($C$3,D$7),'N data'!$N$1:$BG$133,$M33,FALSE),\"\")","v":""},{"$f":"IFERROR(VLOOKUP(CONCATENATE($C$3,E$7),'N data'!$N$1:$BG$133,$M33,FALSE),\"\")","v":""},{"$f":"IFERROR(VLOOKUP(CONCATENATE($C$3,F$7),'N data'!$N$1:$BG$133,$M33,FALSE),\"\")","v":""},null,null,null,null,null,"N26",32]
[null,{"$f":"IF('N data'!D35=\"\",\"\",'N data'!D35)","v":""},{"$f":"IFERROR(VLOOKUP(CONCATENATE($C$3,C$7),'N data'!$N$1:$BG$133,$M34,FALSE),\"\")","v":""},{"$f":"IFERROR(VLOOKUP(CONCATENATE($C$3,D$7),'N data'!$N$1:$BG$133,$M34,FALSE),\"\")","v":""},{"$f":"IFERROR(VLOOKUP(CONCATENATE($C$3,E$7),'N data'!$N$1:$BG$133,$M34,FALSE),\"\")","v":""},{"$f":"IFERROR(VLOOKUP(CONCATENATE($C$3,F$7),'N data'!$N$1:$BG$133,$M34,FALSE),\"\")","v":""},null,null,null,null,null,"N27",33]
[null,{"$f":"IF('N data'!D36=\"\",\"\",'N data'!D36)","v":""},{"$f":"IFERROR(VLOOKUP(CONCATENATE($C$3,C$7),'N data'!$N$1:$BG$133,$M35,FALSE),\"\")","v":""},{"$f":"IFERROR(VLOOKUP(CONCATENATE($C$3,D$7),'N data'!$N$1:$BG$133,$M35,FALSE),\"\")","v":""},{"$f":"IFERROR(VLOOKUP(CONCATENATE($C$3,E$7),'N data'!$N$1:$BG$133,$M35,FALSE),\"\")","v":""},{"$f":"IFERROR(VLOOKUP(CONCATENATE($C$3,F$7),'N data'!$N$1:$BG$133,$M35,FALSE),\"\")","v":""},null,null,null,null,null,"N28",34]
[null,{"$f":"IF('N data'!D37=\"\",\"\",'N data'!D37)","v":""},{"$f":"IFERROR(VLOOKUP(CONCATENATE($C$3,C$7),'N data'!$N$1:$BG$133,$M36,FALSE),\"\")","v":""},{"$f":"IFERROR(VLOOKUP(CONCATENATE($C$3,D$7),'N data'!$N$1:$BG$133,$M36,FALSE),\"\")","v":""},{"$f":"IFERROR(VLOOKUP(CONCATENATE($C$3,E$7),'N data'!$N$1:$BG$133,$M36,FALSE),\"\")","v":""},{"$f":"IFERROR(VLOOKUP(CONCATENATE($C$3,F$7),'N data'!$N$1:$BG$133,$M36,FALSE),\"\")","v":""},null,null,null,null,null,"N29",35]
[null,{"$f":"IF('N data'!D38=\"\",\"\",'N data'!D38)","v":""},{"$f":"IFERROR(VLOOKUP(CONCATENATE($C$3,C$7),'N data'!$N$1:$BG$133,$M37,FALSE),\"\")","v":""},{"$f":"IFERROR(VLOOKUP(CONCATENATE($C$3,D$7),'N data'!$N$1:$BG$133,$M37,FALSE),\"\")","v":""},{"$f":"IFERROR(VLOOKUP(CONCATENATE($C$3,E$7),'N data'!$N$1:$BG$133,$M37,FALSE),\"\")","v":""},{"$f":"IFERROR(VLOOKUP(CONCATENATE($C$3,F$7),'N data'!$N$1:$BG$133,$M37,FALSE),\"\")","v":""},null,null,null,null,null,"N30",36]
[null,{"$f":"IF('N data'!D39=\"\",\"\",'N data'!D39)","v":""},{"$f":"IFERROR(VLOOKUP(CONCATENATE($C$3,C$7),'N data'!$N$1:$BG$133,$M38,FALSE),\"\")","v":""},{"$f":"IFERROR(VLOOKUP(CONCATENATE($C$3,D$7),'N data'!$N$1:$BG$133,$M38,FALSE),\"\")","v":""},{"$f":"IFERROR(VLOOKUP(CONCATENATE($C$3,E$7),'N data'!$N$1:$BG$133,$M38,FALSE),\"\")","v":""},{"$f":"IFERROR(VLOOKUP(CONCATENATE($C$3,F$7),'N data'!$N$1:$BG$133,$M38,FALSE),\"\")","v":""},null,null,null,null,null,"N31",37]
[null,{"$f":"IF('N data'!D40=\"\",\"\",'N data'!D40)","v":""},{"$f":"IFERROR(VLOOKUP(CONCATENATE($C$3,C$7),'N data'!$N$1:$BG$133,$M39,FALSE),\"\")","v":""},{"$f":"IFERROR(VLOOKUP(CONCATENATE($C$3,D$7),'N data'!$N$1:$BG$133,$M39,FALSE),\"\")","v":""},{"$f":"IFERROR(VLOOKUP(CONCATENATE($C$3,E$7),'N data'!$N$1:$BG$133,$M39,FALSE),\"\")","v":""},{"$f":"IFERROR(VLOOKUP(CONCATENATE($C$3,F$7),'N data'!$N$1:$BG$133,$M39,FALSE),\"\")","v":""},null,null,null,null,null,"N32",38]
[null,{"$f":"IF('N data'!D41=\"\",\"\",'N data'!D41)","v":""},{"$f":"IFERROR(VLOOKUP(CONCATENATE($C$3,C$7),'N data'!$N$1:$BG$133,$M40,FALSE),\"\")","v":""},{"$f":"IFERROR(VLOOKUP(CONCATENATE($C$3,D$7),'N data'!$N$1:$BG$133,$M40,FALSE),\"\")","v":""},{"$f":"IFERROR(VLOOKUP(CONCATENATE($C$3,E$7),'N data'!$N$1:$BG$133,$M40,FALSE),\"\")","v":""},{"$f":"IFERROR(VLOOKUP(CONCATENATE($C$3,F$7),'N data'!$N$1:$BG$133,$M40,FALSE),\"\")","v":""},null,null,null,null,null,"N33",39]
[null,{"$f":"IF('N data'!D42=\"\",\"\",'N data'!D42)","v":""},{"$f":"IFERROR(VLOOKUP(CONCATENATE($C$3,C$7),'N data'!$N$1:$BG$133,$M41,FALSE),\"\")","v":""},{"$f":"IFERROR(VLOOKUP(CONCATENATE($C$3,D$7),'N data'!$N$1:$BG$133,$M41,FALSE),\"\")","v":""},{"$f":"IFERROR(VLOOKUP(CONCATENATE($C$3,E$7),'N data'!$N$1:$BG$133,$M41,FALSE),\"\")","v":""},{"$f":"IFERROR(VLOOKUP(CONCATENATE($C$3,F$7),'N data'!$N$1:$BG$133,$M41,FALSE),\"\")","v":""},null,null,null,null,null,"N34",40]
[null,{"$f":"IF('N data'!D43=\"\",\"\",'N data'!D43)","v":""},{"$f":"IFERROR(VLOOKUP(CONCATENATE($C$3,C$7),'N data'!$N$1:$BG$133,$M42,FALSE),\"\")","v":""},{"$f":"IFERROR(VLOOKUP(CONCATENATE($C$3,D$7),'N data'!$N$1:$BG$133,$M42,FALSE),\"\")","v":""},{"$f":"IFERROR(VLOOKUP(CONCATENATE($C$3,E$7),'N data'!$N$1:$BG$133,$M42,FALSE),\"\")","v":""},{"$f":"IFERROR(VLOOKUP(CONCATENATE($C$3,F$7),'N data'!$N$1:$BG$133,$M42,FALSE),\"\")","v":""},null,null,null,null,null,"N35",41]
[null,{"$f":"IF('N data'!D44=\"\",\"\",'N data'!D44)","v":""},{"$f":"IFERROR(VLOOKUP(CONCATENATE($C$3,C$7),'N data'!$N$1:$BG$133,$M43,FALSE),\"\")","v":""},{"$f":"IFERROR(VLOOKUP(CONCATENATE($C$3,D$7),'N data'!$N$1:$BG$133,$M43,FALSE),\"\")","v":""},{"$f":"IFERROR(VLOOKUP(CONCATENATE($C$3,E$7),'N data'!$N$1:$BG$133,$M43,FALSE),\"\")","v":""},{"$f":"IFERROR(VLOOKUP(CONCATENATE($C$3,F$7),'N data'!$N$1:$BG$133,$M43,FALSE),\"\")","v":""},null,null,null,null,null,"N36",42]
[null,{"$f":"IF('N data'!D45=\"\",\"\",'N data'!D45)","v":""},{"$f":"IFERROR(VLOOKUP(CONCATENATE($C$3,C$7),'N data'!$N$1:$BG$133,$M44,FALSE),\"\")","v":""},{"$f":"IFERROR(VLOOKUP(CONCATENATE($C$3,D$7),'N data'!$N$1:$BG$133,$M44,FALSE),\"\")","v":""},{"$f":"IFERROR(VLOOKUP(CONCATENATE($C$3,E$7),'N data'!$N$1:$BG$133,$M44,FALSE),\"\")","v":""},{"$f":"IFERROR(VLOOKUP(CONCATENATE($C$3,F$7),'N data'!$N$1:$BG$133,$M44,FALSE),\"\")","v":""},null,null,null,null,null,"N37",43]
[null,{"$f":"IF('N data'!D46=\"\",\"\",'N data'!D46)","v":""},{"$f":"IFERROR(VLOOKUP(CONCATENATE($C$3,C$7),'N data'!$N$1:$BG$133,$M45,FALSE),\"\")","v":""},{"$f":"IFERROR(VLOOKUP(CONCATENATE($C$3,D$7),'N data'!$N$1:$BG$133,$M45,FALSE),\"\")","v":""},{"$f":"IFERROR(VLOOKUP(CONCATENATE($C$3,E$7),'N data'!$N$1:$BG$133,$M45,FALSE),\"\")","v":""},{"$f":"IFERROR(VLOOKUP(CONCATENATE($C$3,F$7),'N data'!$N$1:$BG$133,$M45,FALSE),\"\")","v":""},null,null,null,null,null,"N38",44]
[null,{"$f":"IF('N data'!D47=\"\",\"\",'N data'!D47)","v":""},{"$f":"IFERROR(VLOOKUP(CONCATENATE($C$3,C$7),'N data'!$N$1:$BG$133,$M46,FALSE),\"\")","v":""},{"$f":"IFERROR(VLOOKUP(CONCATENATE($C$3,D$7),'N data'!$N$1:$BG$133,$M46,FALSE),\"\")","v":""},{"$f":"IFERROR(VLOOKUP(CONCATENATE($C$3,E$7),'N data'!$N$1:$BG$133,$M46,FALSE),\"\")","v":""},{"$f":"IFERROR(VLOOKUP(CONCATENATE($C$3,F$7),'N data'!$N$1:$BG$133,$M46,FALSE),\"\")","v":""},null,null,null,null,null,"N39",45]
[null,{"$f":"IF('N data'!D48=\"\",\"\",'N data'!D48)","v":""},{"$f":"IFERROR(VLOOKUP(CONCATENATE($C$3,C$7),'N data'!$N$1:$BG$133,$M47,FALSE),\"\")","v":""},{"$f":"IFERROR(VLOOKUP(CONCATENATE($C$3,D$7),'N data'!$N$1:$BG$133,$M47,FALSE),\"\")","v":""},{"$f":"IFERROR(VLOOKUP(CONCATENATE($C$3,E$7),'N data'!$N$1:$BG$133,$M47,FALSE),\"\")","v":""},{"$f":"IFERROR(VLOOKUP(CONCATENATE($C$3,F$7),'N data'!$N$1:$BG$133,$M47,FALSE),\"\")","v":""},null,null,null,null,null,"N40",46]
[]
[]
[]
[]
[]
[]
[]
[]
[null,null,null,null,null,null,null,null,null,null,null,null,null,"Patientmedverkan för ökad riskmedvetenhet och beredskap"]

{"sheet":"2.1 Sammanställning","index":7,"n_rows":6,"n_cols":10,"rows_kept":6,"cut":false,"hidden":false,"merged":[[5,11,5,14],[1,1,1,8],[3,1,3,9]]}
[]
[null,"Sammanställning av identifierade insatser och åtgärder "]
[]
[null,"Information: Nedan listas insatser som har identifierats på de olika ställen där verktyget har använts. Använd pilknapparna för att filtrera ut insatser, ex. inom ett visst tema eller för att sortera om insatserna, ex. utifrån lägst uppskattad resursåtgång eller störst förväntad effekt. Tips! Om en del av en beskrivning av en insats är dold så går det bra att bredda raderna genom att i vänstermarginalen dubbelklicka på strecket mellan raderna."]
[]
[null,"Svarande","Område","Tema","Insats","Aktör","Kontakt","Uppskattad resursåtgång","Förväntad effekt","Priovärde"]