{"text_format":"1","workbook":"xlsx","n_sheets":8,"sheets":["N data","N datadyn","S datadyn","Introduktion","Import","1.1 Sammanvägd nulägesanalys","1.2 Nulägesöversikt","2.1 Sammanställning"],"not_rendered":{"charts":0,"images":8,"macros":1,"external_links":0,"defined_names":4,"comments":0,"pivot_tables":0},"unopened":[],"bounds":{"document_bytes":16777216,"sheet_cells":100000,"rows_first":2000,"rows_last":500,"rows_between":2000,"halvings":0,"cell_chars":16384,"cell_head_chars":4096},"cells_cut":0,"cells_raw":0,"read":"whole","date_system":"1900"}

{"sheet":"N data","index":0,"n_rows":0,"n_cols":0,"rows_kept":0,"cut":false,"hidden":true,"merged":[]}

{"sheet":"N datadyn","index":1,"n_rows":133,"n_cols":59,"rows_kept":133,"cut":false,"hidden":true,"merged":[]}
[null,"Concatenate:"," ",{"$f":"LEN(B8)","v":23},null,"Hjälp 1",null,null,"Upprepning","Hjälp2",null,null,null,null,"Genomsnitt ja-nej","Summa","Antal ja-nej","Kvot info saknas","Antal info saknas","N1","N2","N3","N4","N5","N6","N7","N8","N9","N10","N11","N12","N13","N14","N15","N16","N17","N18","N19","N20","N21","N22","N23","N24","N25","N26","N27","N28","N29","N30","N31","N32","N33","N34","N35","N36","N37","N38","N39","N40"]
[null,{"$f":"CONCATENATE(D9,C1,D10,C1,D11,C1,D12,C1,D13,C1,D14,C1,D15,C1,D16,C1,D17,C1,D18,C1,D19,C1,D20,C1,D21,C1,D22,C1,D23,C1,D24,C1,D25,C1,D26,C1,D27,C1,D28,C1,D29,C1,D30,C1,D31,C1,D32,C1,D33,C1,D34,C1,D35,C1,D36,C1,D37,C1,D38,C1,D39,C1,D40,C1,D41,C1,D42,C1,D43,C1,D44,C1,D45,C1,D46,C1,D47,C1,D48)","v":"                                       "},null,null,null,1,1,"En god säkerhetskultur",4,1,{"$f":"VLOOKUP($J2,$F$2:$H$34,3,TRUE)","v":"En god säkerhetskultur"},"A. Tillräcklig kunskap?",{"$f":"VLOOKUP(L2,$H$43:$I$46,2,FALSE)","v":2},{"$f":"CONCATENATE(K2,L2)","v":"En god säkerhetskulturA. Tillräcklig kunskap?"},{"$f":"IFERROR(P2/Q2,\"\")","v":""},{"$f":"SUM(T2:BG2)","v":0},{"$f":"COUNT(IF(T2:BG2<>0,T2:BG2))","v":0},{"$f":"IFERROR(S2/(Q2+S2),\"\")","v":""},{"$f":"COUNTIF(T2:BG2,0)","v":0},{"$f":"IFERROR(VLOOKUP($K2, INDIRECT(\"'\"&T$1&\"'!$B$4:$F$46\"),$M2,FALSE),\"\")","v":""},{"$f":"IFERROR(VLOOKUP($K2, INDIRECT(\"'\"&U$1&\"'!$B$4:$F$46\"),$M2,FALSE),\"\")","v":""},"","","","","","","","","","","","","","","","","","","","","","","","","","","","","","","","","","","","","",""]
[null,null,null,null,null,{"$f":"F2+I2","v":5},2,"Adekvat kunskap och kompetens",4,2,{"$f":"VLOOKUP($J3,$F$2:$H$34,3,TRUE)","v":"En god säkerhetskultur"},"B. Tillräckliga stöd?",{"$f":"VLOOKUP(L3,$H$43:$I$46,2,FALSE)","v":3},{"$f":"CONCATENATE(K3,L3)","v":"En god säkerhetskulturB. Tillräckliga stöd?"},"",0,{"$f":"COUNT(IF(T3:BG3<>0,T3:BG3))","v":0},{"$f":"IFERROR(S3/(Q3+S3),\"\")","v":""},0,{"$f":"IFERROR(VLOOKUP($K3, INDIRECT(\"'\"&T$1&\"'!$B$4:$F$46\"),$M3,FALSE),\"\")","v":""},"","","","","","","","","","","","","","","","","","","","","","","","","","","","","","","","","","","","","","",""]
[null,null,null,null,null,9,3,"Patienten som medskapare",4,3,"En god säkerhetskultur","C. Används kunskap och stöd?",4,"En god säkerhetskulturC. Används kunskap och stöd?","",0,{"$f":"COUNT(IF(T4:BG4<>0,T4:BG4))","v":0},"",0,"","","","","","","","","","","","","","","","","","","","","","","","","","","","","","","","","","","","","","","",""]
[null,null,null,null,null,13,4,"Patienter och närståendes erfarenheter av vårdskador",4,4,"En god säkerhetskultur","D. Beskrivning av utmaningar, hinder och möjliggörare",5,"En god säkerhetskulturD. Beskrivning av utmaningar, hinder och möjliggörare","",0,{"$f":"COUNT(IF(T5:BG5<>0,T5:BG5))","v":0},"",0,"","","","","","","","","","","","","","","","","","","","","","","","","","","","","","","","","","","","","","","",""]
[null,null,null,null,null,17,5,"Patientmedverkan i utveckling av processer och arbetssätt",4,5,"Adekvat kunskap och kompetens","A. Tillräcklig kunskap?",2,"Adekvat kunskap och kompetensA. Tillräcklig kunskap?","",0,{"$f":"COUNT(IF(T6:BG6<>0,T6:BG6))","v":0},"",0,"","","","","","","","","","","","","","","","","","","","","","","","","","","","","","","","","","","","","","","",""]
[null,null,null,null,null,21,6,"Patientens delaktighet i den egna vården",4,6,"Adekvat kunskap och kompetens","B. Tillräckliga stöd?",3,"Adekvat kunskap och kompetensB. Tillräckliga stöd?","",0,{"$f":"COUNT(IF(T7:BG7<>0,T7:BG7))","v":0},"",0,"","","","","","","","","","","","","","","","","","","","","","","","","","","","","","","","","","","","","","","",""]
[null,"Nulägesanalysen avser: ","fliknamn","Förkortat namn:",null,25,7,"Patientmedverkan för ökad riskmedvetenhet och beredskap",4,7,"Adekvat kunskap och kompetens","C. Används kunskap och stöd?",4,"Adekvat kunskap och kompetensC. Används kunskap och stöd?","",0,{"$f":"COUNT(IF(T8:BG8<>0,T8:BG8))","v":0},"",0,"","","","","","","","","","","","","","","","","","","","","","","","","","","","","","","","","","","","","",{"$f":"IFERROR(VLOOKUP($K8, INDIRECT(\"'\"&BE$1&\"'!$B$4:$F$46\"),$M8,FALSE),\"\")","v":""},"",""]
{"$rows_left_out":126}
{"sheet":"S datadyn","index":2,"n_rows":478,"n_cols":42,"rows_kept":478,"cut":false,"hidden":true,"merged":[[1,11,1,14]]}
[]
[null,"Svarande","Område","Tema","Insats","Aktör","Kontakt","Uppskattad resursåtgång","Förväntad effekt","Prio-värde",null,"Tips: Använd pilknapparna för att filtrera ut insatser ex. inom ett visst tema eller för att sortera insatserna i en annan ordning",null,null,null,null,null,null,null,null,{"$f":"LEN(V2)","v":23},"Nulägesanalysen avser: ","fliknamn",null,"Finns fliken?","hjälpkolumn1","Fliknamn","Antal rader som inte är tomma","hjälpkolumn2","Vlookup till sammanställningen","Offset",null,1,2,3,4,5,6,7,8,9,10]
[null,{"$f":"IF($AE3<>\"\",VLOOKUP(AD3,$W$3:$X$42,2,FALSE),\"\")","v":""},{"$f":"IF($AE3<>\"\",INDEX(INDIRECT(\"'\"&$AD3&\"'!$B$7:$I$100\"),$AE3,AG$2),\"\")","v":""},{"$f":"IF($AE3<>\"\",INDEX(INDIRECT(\"'\"&$AD3&\"'!$B$7:$I$100\"),$AE3,AH$2),\"\")","v":""},{"$f":"IF($AE3<>\"\",INDEX(INDIRECT(\"'\"&$AD3&\"'!$B$7:$I$100\"),$AE3,AI$2),\"\")","v":""},{"$f":"IF($AE3<>\"\",INDEX(INDIRECT(\"'\"&$AD3&\"'!$B$7:$I$100\"),$AE3,AJ$2),\"\")","v":""},{"$f":"IF($AE3<>\"\",INDEX(INDIRECT(\"'\"&$AD3&\"'!$B$7:$I$100\"),$AE3,AK$2),\"\")","v":""},{"$f":"IF($AE3<>\"\",INDEX(INDIRECT(\"'\"&$AD3&\"'!$B$7:$I$100\"),$AE3,AL$2),\"\")","v":""},{"$f":"IF($AE3<>\"\",INDEX(INDIRECT(\"'\"&$AD3&\"'!$B$7:$I$100\"),$AE3,AM$2),\"\")","v":""},{"$f":"IF($AE3<>\"\",INDEX(INDIRECT(\"'\"&$AD3&\"'!$B$7:$I$100\"),$AE3,AN$2),\"\")","v":""},null,null,null,null,null,null,null,null,null,null,null,{"$f":"IFERROR( INDIRECT(\"'\"&$W3&\"'!$B$4\"), \"\")","v":""},"S1",{"$f":"V3","v":""},{"$f":"ISREF(INDIRECT(\"'\"&$W3&\"'!A1\"))","v":false},1,"S1",{"$f":"IF(Y3=TRUE,COUNTA(INDIRECT(\"'\"&$W3&\"'!$B$7\"):INDIRECT(\"'\"&$W3&\"'!$B$64\")),\"\")","v":""},1,{"$f":"VLOOKUP(AC3,$Z$3:$AA41,2)","v":"S1"},{"$f":"IF(VLOOKUP(AD3,$W$3:$AD$102,3,FALSE)=TRUE,1,\"\")","v":""}]
[null,{"$f":"IF($AE4<>\"\",VLOOKUP(AD4,$W$3:$X$42,2,FALSE),\"\")","v":""},{"$f":"IF($AE4<>\"\",INDEX(INDIRECT(\"'\"&$AD4&\"'!$B$7:$I$100\"),$AE4,AG$2),\"\")","v":""},{"$f":"IF($AE4<>\"\",INDEX(INDIRECT(\"'\"&$AD4&\"'!$B$7:$I$100\"),$AE4,AH$2),\"\")","v":""},{"$f":"IF($AE4<>\"\",INDEX(INDIRECT(\"'\"&$AD4&\"'!$B$7:$I$100\"),$AE4,AI$2),\"\")","v":""},{"$f":"IF($AE4<>\"\",INDEX(INDIRECT(\"'\"&$AD4&\"'!$B$7:$I$100\"),$AE4,AJ$2),\"\")","v":""},{"$f":"IF($AE4<>\"\",INDEX(INDIRECT(\"'\"&$AD4&\"'!$B$7:$I$100\"),$AE4,AK$2),\"\")","v":""},{"$f":"IF($AE4<>\"\",INDEX(INDIRECT(\"'\"&$AD4&\"'!$B$7:$I$100\"),$AE4,AL$2),\"\")","v":""},{"$f":"IF($AE4<>\"\",INDEX(INDIRECT(\"'\"&$AD4&\"'!$B$7:$I$100\"),$AE4,AM$2),\"\")","v":""},{"$f":"IF($AE4<>\"\",INDEX(INDIRECT(\"'\"&$AD4&\"'!$B$7:$I$100\"),$AE4,AN$2),\"\")","v":""},null,null,null,null,null,null,null,null,null,null,null,{"$f":"IFERROR( INDIRECT(\"'\"&$W4&\"'!$B$4\"), \"\")","v":""},"S2",{"$f":"V4","v":""},{"$f":"ISREF(INDIRECT(\"'\"&$W4&\"'!A1\"))","v":false},{"$f":"AB3+Z3","v":{"$error":"#VALUE!"}},"S2",{"$f":"IF(Y4=TRUE,COUNTA(INDIRECT(\"'\"&$W4&\"'!$B$7\"):INDIRECT(\"'\"&$W4&\"'!$B$64\")),\"\")","v":""},2,{"$f":"VLOOKUP(AC4,$Z$3:$AA42,2)","v":"S1"},{"$f":"IF(VLOOKUP(AD4,$W$3:$AD$102,3,FALSE)=TRUE,IF(AD4=AD3,AE3+1,1),\"\")","v":""}]
[null,"",{"$f":"IF($AE5<>\"\",INDEX(INDIRECT(\"'\"&$AD5&\"'!$B$7:$I$100\"),$AE5,AG$2),\"\")","v":""},{"$f":"IF($AE5<>\"\",INDEX(INDIRECT(\"'\"&$AD5&\"'!$B$7:$I$100\"),$AE5,AH$2),\"\")","v":""},{"$f":"IF($AE5<>\"\",INDEX(INDIRECT(\"'\"&$AD5&\"'!$B$7:$I$100\"),$AE5,AI$2),\"\")","v":""},{"$f":"IF($AE5<>\"\",INDEX(INDIRECT(\"'\"&$AD5&\"'!$B$7:$I$100\"),$AE5,AJ$2),\"\")","v":""},{"$f":"IF($AE5<>\"\",INDEX(INDIRECT(\"'\"&$AD5&\"'!$B$7:$I$100\"),$AE5,AK$2),\"\")","v":""},{"$f":"IF($AE5<>\"\",INDEX(INDIRECT(\"'\"&$AD5&\"'!$B$7:$I$100\"),$AE5,AL$2),\"\")","v":""},{"$f":"IF($AE5<>\"\",INDEX(INDIRECT(\"'\"&$AD5&\"'!$B$7:$I$100\"),$AE5,AM$2),\"\")","v":""},{"$f":"IF($AE5<>\"\",INDEX(INDIRECT(\"'\"&$AD5&\"'!$B$7:$I$100\"),$AE5,AN$2),\"\")","v":""},null,null,null,null,null,null,null,null,null,null,null,{"$f":"IFERROR( INDIRECT(\"'\"&$W5&\"'!$B$4\"), \"\")","v":""},"S3","",false,{"$error":"#VALUE!"},"S3",{"$f":"IF(Y5=TRUE,COUNTA(INDIRECT(\"'\"&$W5&\"'!$B$7\"):INDIRECT(\"'\"&$W5&\"'!$B$64\")),\"\")","v":""},3,{"$f":"VLOOKUP(AC5,$Z$3:$AA43,2)","v":"S1"},{"$f":"IF(VLOOKUP(AD5,$W$3:$AD$102,3,FALSE)=TRUE,IF(AD5=AD4,AE4+1,1),\"\")","v":""}]
[null,"",{"$f":"IF($AE6<>\"\",INDEX(INDIRECT(\"'\"&$AD6&\"'!$B$7:$I$100\"),$AE6,AG$2),\"\")","v":""},{"$f":"IF($AE6<>\"\",INDEX(INDIRECT(\"'\"&$AD6&\"'!$B$7:$I$100\"),$AE6,AH$2),\"\")","v":""},{"$f":"IF($AE6<>\"\",INDEX(INDIRECT(\"'\"&$AD6&\"'!$B$7:$I$100\"),$AE6,AI$2),\"\")","v":""},{"$f":"IF($AE6<>\"\",INDEX(INDIRECT(\"'\"&$AD6&\"'!$B$7:$I$100\"),$AE6,AJ$2),\"\")","v":""},{"$f":"IF($AE6<>\"\",INDEX(INDIRECT(\"'\"&$AD6&\"'!$B$7:$I$100\"),$AE6,AK$2),\"\")","v":""},{"$f":"IF($AE6<>\"\",INDEX(INDIRECT(\"'\"&$AD6&\"'!$B$7:$I$100\"),$AE6,AL$2),\"\")","v":""},{"$f":"IF($AE6<>\"\",INDEX(INDIRECT(\"'\"&$AD6&\"'!$B$7:$I$100\"),$AE6,AM$2),\"\")","v":""},{"$f":"IF($AE6<>\"\",INDEX(INDIRECT(\"'\"&$AD6&\"'!$B$7:$I$100\"),$AE6,AN$2),\"\")","v":""},null,null,null,null,null,null,null,null,null,null,null,{"$f":"IFERROR( INDIRECT(\"'\"&$W6&\"'!$B$4\"), \"\")","v":""},"S4","",false,{"$error":"#VALUE!"},"S4",{"$f":"IF(Y6=TRUE,COUNTA(INDIRECT(\"'\"&$W6&\"'!$B$7\"):INDIRECT(\"'\"&$W6&\"'!$B$64\")),\"\")","v":""},4,{"$f":"VLOOKUP(AC6,$Z$3:$AA44,2)","v":"S1"},""]
[null,"",{"$f":"IF($AE7<>\"\",INDEX(INDIRECT(\"'\"&$AD7&\"'!$B$7:$I$100\"),$AE7,AG$2),\"\")","v":""},{"$f":"IF($AE7<>\"\",INDEX(INDIRECT(\"'\"&$AD7&\"'!$B$7:$I$100\"),$AE7,AH$2),\"\")","v":""},{"$f":"IF($AE7<>\"\",INDEX(INDIRECT(\"'\"&$AD7&\"'!$B$7:$I$100\"),$AE7,AI$2),\"\")","v":""},{"$f":"IF($AE7<>\"\",INDEX(INDIRECT(\"'\"&$AD7&\"'!$B$7:$I$100\"),$AE7,AJ$2),\"\")","v":""},{"$f":"IF($AE7<>\"\",INDEX(INDIRECT(\"'\"&$AD7&\"'!$B$7:$I$100\"),$AE7,AK$2),\"\")","v":""},{"$f":"IF($AE7<>\"\",INDEX(INDIRECT(\"'\"&$AD7&\"'!$B$7:$I$100\"),$AE7,AL$2),\"\")","v":""},{"$f":"IF($AE7<>\"\",INDEX(INDIRECT(\"'\"&$AD7&\"'!$B$7:$I$100\"),$AE7,AM$2),\"\")","v":""},{"$f":"IF($AE7<>\"\",INDEX(INDIRECT(\"'\"&$AD7&\"'!$B$7:$I$100\"),$AE7,AN$2),\"\")","v":""},null,null,null,null,null,null,null,null,null,null,null,{"$f":"IFERROR( INDIRECT(\"'\"&$W7&\"'!$B$4\"), \"\")","v":""},"S5","",false,{"$error":"#VALUE!"},"S5",{"$f":"IF(Y7=TRUE,COUNTA(INDIRECT(\"'\"&$W7&\"'!$B$7\"):INDIRECT(\"'\"&$W7&\"'!$B$64\")),\"\")","v":""},5,{"$f":"VLOOKUP(AC7,$Z$3:$AA45,2)","v":"S1"},""]
[null,"",{"$f":"IF($AE8<>\"\",INDEX(INDIRECT(\"'\"&$AD8&\"'!$B$7:$I$100\"),$AE8,AG$2),\"\")","v":""},{"$f":"IF($AE8<>\"\",INDEX(INDIRECT(\"'\"&$AD8&\"'!$B$7:$I$100\"),$AE8,AH$2),\"\")","v":""},{"$f":"IF($AE8<>\"\",INDEX(INDIRECT(\"'\"&$AD8&\"'!$B$7:$I$100\"),$AE8,AI$2),\"\")","v":""},{"$f":"IF($AE8<>\"\",INDEX(INDIRECT(\"'\"&$AD8&\"'!$B$7:$I$100\"),$AE8,AJ$2),\"\")","v":""},{"$f":"IF($AE8<>\"\",INDEX(INDIRECT(\"'\"&$AD8&\"'!$B$7:$I$100\"),$AE8,AK$2),\"\")","v":""},{"$f":"IF($AE8<>\"\",INDEX(INDIRECT(\"'\"&$AD8&\"'!$B$7:$I$100\"),$AE8,AL$2),\"\")","v":""},{"$f":"IF($AE8<>\"\",INDEX(INDIRECT(\"'\"&$AD8&\"'!$B$7:$I$100\"),$AE8,AM$2),\"\")","v":""},{"$f":"IF($AE8<>\"\",INDEX(INDIRECT(\"'\"&$AD8&\"'!$B$7:$I$100\"),$AE8,AN$2),\"\")","v":""},null,null,null,null,null,null,null,null,null,null,null,{"$f":"IFERROR( INDIRECT(\"'\"&$W8&\"'!$B$4\"), \"\")","v":""},"S6","",false,{"$error":"#VALUE!"},"S6",{"$f":"IF(Y8=TRUE,COUNTA(INDIRECT(\"'\"&$W8&\"'!$B$7\"):INDIRECT(\"'\"&$W8&\"'!$B$64\")),\"\")","v":""},6,{"$f":"VLOOKUP(AC8,$Z$3:$AA46,2)","v":"S1"},""]
{"$rows_left_out":471}
{"sheet":"Introduktion","index":3,"n_rows":31,"n_cols":5,"rows_kept":31,"cut":false,"hidden":false,"merged":[[28,1,28,2],[29,1,29,2],[30,1,30,2],[22,1,22,4],[3,1,5,4],[25,1,25,2],[26,1,26,2],[27,1,27,2],[17,1,18,1],[8,1,8,4],[9,1,9,4],[12,1,12,4]]}
[]
[]
[null,"Introduktion till denna Excelfil"]
[null,"Denna fil, Sammanställning av flera verktyg för stärkt patientsäkerhet inom kunskapsstyrning, är utvecklad av Nationell samverkansgrupp för patientsäkerhet (NSG patientsäkerhet) i samverkan med Sveriges Kommuner och Regioner (SKR). Denna fil är framtagen tillsammans med Verktyg för stärkt patientsäkerhet inom kunskapsstyrning, för att möjliggöra sammanställning av olika nulägesanalyser och identifierade insatser då verktyget har använts på flera ställen inom ett programområde. Syftet är att stödja de nationella programområdena (NPO) i deras kunskapsstyrning för ökad patientsäkerhet, i enlighet med den nationella handlingsplanen för ökad patientsäkerhet. \n\nExcelfilens uppbyggnad\nExcelfilen Sammanställning av flera verktyg för stärkt patientsäkerhet inom kunskapsstyrning ger en sammanfattning av de olika nulägesanalyser och identifierade insatser som ni har tagit fram där ni använt verktyget Verktyg för stärkt patientsäkerhet inom kunskapsstyrning. Filen består av följande flikar:\n- Introduktion ger instruktioner till hur filen kan användas och länkar vidare till filens olika delar\n- Import är den flik som ni använder för att importera information från de verktyg som ni vill sammanställa\n- 1.1 Sammanvägd nulägesanalys ger sammanvägda svar på frågorna per tema för de olika nulägesanalyserna\n- 1.2 Nulägesöversikt ger er möjlighet att välja ett temaområde och se resultatet uppdelat per genomförd nulägesanalys\n- 2.1 Sammanställning sammanställer en lista över alla identifierade insatser för de olika ställen där verktyget har använts. \n\nVill ni rensa era svar i verktyget under en viss flik eller i hela dokumentet?\nLängst ned på denna sida finns en knapp för att nollställa hela verktyget. Notera att allt ni fyllt i kommer att raderas om ni väljer att klicka på denna. Om ni enbart vill nollställa det ni fyllt i under en viss flik för att börja om från början, går detta att göra under den enskilda fliken. \n\n\n"]
[]
[]
[]
[null,"Instruktioner finns i genomförandestödet"]
{"$rows_left_out":24}
{"sheet":"Import","index":4,"n_rows":1,"n_cols":2,"rows_kept":1,"cut":false,"hidden":false,"merged":[]}
[null,"Mapp som analysen utgår från:"]

{"sheet":"1.1 Sammanvägd nulägesanalys","index":5,"n_rows":33,"n_cols":20,"rows_kept":33,"cut":false,"hidden":false,"merged":[[3,2,3,3],[3,4,3,5],[3,6,3,7],[1,2,1,7],[3,9,4,15]]}
[]
[null,"Sammanvägd nulägesanalys",{"$f":"IF('N data'!B2=\"\",\"\",'N data'!B2)","v":""}]
[]
[null,null,"A. Tillräcklig kunskap?",null,"B. Tillräckliga stöd?",null,"C. Används kunskap och stöd?",null,null,"Information: På denna sida ser ni ett sammanvägt resultat för alla genomförda nulägesanalyser som inkluderats i sammanställningen. \n\nFör varje tema och per fråga A, B och C finns det en sammanvägning av samtliga resultat utifrån färgskalan nedan. Därutöver ser ni hur stor andel av de svarande som har angett att tillräcklig information saknas i en egen cell för varje fråga. När andelen uppgår till 25 procent eller mer markeras den aktuella cellen som gul, tillsammans med en gul flaggsymbol."]
[null,null,"Sammanvägt svar (ja, ja i huvudsak, till viss del, nej)","Andel som svarat att tillräcklig information saknas ","Sammanvägt svar (ja, ja i huvudsak, till viss del, nej)","Andel som svarat att tillräcklig information saknas ","Sammanvägt svar (ja, ja i huvudsak, till viss del, nej)","Andel som svarat att tillräcklig information saknas "]
[null,"\nGrundläggande förutsättningar för patientsäkerhetsarbete"]
[null,"En god säkerhetskultur",{"$f":"IFERROR(VLOOKUP(CONCATENATE('1.1 Sammanvägd nulägesanalys'!$B7,'1.1 Sammanvägd nulägesanalys'!$C$4),'N data'!$N$1:$BG$133,2,FALSE),\"\")","v":""},{"$f":"IFERROR(VLOOKUP(CONCATENATE('1.1 Sammanvägd nulägesanalys'!$B7,'1.1 Sammanvägd nulägesanalys'!$C$4),'N data'!$N$1:$BG$133,5,FALSE),\"\")","v":""},{"$f":"IFERROR(VLOOKUP(CONCATENATE('1.1 Sammanvägd nulägesanalys'!$B7,'1.1 Sammanvägd nulägesanalys'!$E$4),'N data'!$N$1:$BG$133,2,FALSE),\"\")","v":""},{"$f":"IFERROR(VLOOKUP(CONCATENATE('1.1 Sammanvägd nulägesanalys'!$B7,'1.1 Sammanvägd nulägesanalys'!$E$4),'N data'!$N$1:$BG$133,5,FALSE),\"\")","v":""},{"$f":"IFERROR(VLOOKUP(CONCATENATE('1.1 Sammanvägd nulägesanalys'!$B7,'1.1 Sammanvägd nulägesanalys'!$G$4),'N data'!$N$1:$BG$133,2,FALSE),\"\")","v":""},{"$f":"IFERROR(VLOOKUP(CONCATENATE('1.1 Sammanvägd nulägesanalys'!$B7,'1.1 Sammanvägd nulägesanalys'!$G$4),'N data'!$N$1:$BG$133,5,FALSE),\"\")","v":""},null,null,null,null,null,null,null,null,null,{"$f":"CONCATENATE($B7,C$4)","v":"En god säkerhetskulturA. Tillräcklig kunskap?"},{"$f":"CONCATENATE($B7,E$4)","v":"En god säkerhetskulturB. Tillräckliga stöd?"},{"$f":"CONCATENATE($B7,G$4)","v":"En god säkerhetskulturC. Används kunskap och stöd?"}]
[null,"Adekvat kunskap och kompetens",{"$f":"IFERROR(VLOOKUP(CONCATENATE('1.1 Sammanvägd nulägesanalys'!$B8,'1.1 Sammanvägd nulägesanalys'!$C$4),'N data'!$N$1:$BG$133,2,FALSE),\"\")","v":""},{"$f":"IFERROR(VLOOKUP(CONCATENATE('1.1 Sammanvägd nulägesanalys'!$B8,'1.1 Sammanvägd nulägesanalys'!$C$4),'N data'!$N$1:$BG$133,5,FALSE),\"\")","v":""},{"$f":"IFERROR(VLOOKUP(CONCATENATE('1.1 Sammanvägd nulägesanalys'!$B8,'1.1 Sammanvägd nulägesanalys'!$E$4),'N data'!$N$1:$BG$133,2,FALSE),\"\")","v":""},{"$f":"IFERROR(VLOOKUP(CONCATENATE('1.1 Sammanvägd nulägesanalys'!$B8,'1.1 Sammanvägd nulägesanalys'!$E$4),'N data'!$N$1:$BG$133,5,FALSE),\"\")","v":""},{"$f":"IFERROR(VLOOKUP(CONCATENATE('1.1 Sammanvägd nulägesanalys'!$B8,'1.1 Sammanvägd nulägesanalys'!$G$4),'N data'!$N$1:$BG$133,2,FALSE),\"\")","v":""},{"$f":"IFERROR(VLOOKUP(CONCATENATE('1.1 Sammanvägd nulägesanalys'!$B8,'1.1 Sammanvägd nulägesanalys'!$G$4),'N data'!$N$1:$BG$133,5,FALSE),\"\")","v":""},null,null,null,null,null,null,null,null,null,{"$f":"CONCATENATE($B8,C$4)","v":"Adekvat kunskap och kompetensA. Tillräcklig kunskap?"},{"$f":"CONCATENATE($B8,E$4)","v":"Adekvat kunskap och kompetensB. Tillräckliga stöd?"},{"$f":"CONCATENATE($B8,G$4)","v":"Adekvat kunskap och kompetensC. Används kunskap och stöd?"}]
{"$rows_left_out":26}
{"sheet":"1.2 Nulägesöversikt","index":6,"n_rows":56,"n_cols":19,"rows_kept":56,"cut":false,"hidden":false,"merged":[[2,2,2,5],[1,2,1,5],[4,1,4,2],[1,7,5,8]]}
[null,null,null,null,null,null,null,null,null,null,null,null,null,null,"Aktuell lista","Listkolumn","Aktuell listlängd"]
[null,"Välj fokusområde / grundläggande förutsättning",null,null,null,null,null,"Information: På denna sida kan ni se resultatet från var och en av de genomförda nulägesanalyserna för ett tema i taget.\n\n1. Välj först fokusområde eller grundläggande förutsättning i den översta rullistan.\n2. Välj därefter tema. Obs! Det kan dröja ca 10 sekunder innan alternativen dyker upp.",null,null,null,null,null,"Grundläggande förutsättningar för patientsäkerhetsarbete",{"$f":"HLOOKUP(C2,$N$12:$T$13,2,FALSE)","v":{"$error":"#N/A"}},{"$f":"O2-1","v":{"$error":"#N/A"}},{"$f":"COUNTIF(OFFSET($N$13:$N$27,0,P2),\">\"\"\")","v":{"$error":"#N/A"}}]
[null,"Tema",null,null,null,null,null,null,null,null,null,null,null,"Fokusområde 1: Öka kunskap om inträffade vårdskador"]
[null,null,null,null,null,null,null,null,null,null,null,null,null,"Fokusområde 2: Tillförlitliga och säkra system och processer "]
[null,"Tips! Om delar av en beskrivning av utmaningar, hinder och möjliggörare är dold går det bra att bredda raderna genom att i vänstermarginalen dubbelklicka på strecket mellan raderna.",null,null,null,null,null,null,null,null,null,null,null,"Fokusområde 3: Säker vård här och nu"]
[null,null,null,null,null,null,null,null,null,null,null,null,null,"Fokusområde 4: Stärka analys, lärande och utveckling"]
[null,"Svarande","A. Tillräcklig kunskap?","B. Tillräckliga stöd?","C. Används kunskap och stöd?","D. Beskrivning av utmaningar, hinder och möjliggörare",null,null,null,null,null,null,"kolumn","Fokusområde 5: Öka riskmedvetenhet och beredskap"]
[null,{"$f":"IF('N data'!D9=\"\",\"\",'N data'!D9)","v":""},{"$f":"IFERROR(VLOOKUP(CONCATENATE($C$3,C$7),'N data'!$N$1:$BG$133,$M8,FALSE),\"\")","v":""},{"$f":"IFERROR(VLOOKUP(CONCATENATE($C$3,D$7),'N data'!$N$1:$BG$133,$M8,FALSE),\"\")","v":""},{"$f":"IFERROR(VLOOKUP(CONCATENATE($C$3,E$7),'N data'!$N$1:$BG$133,$M8,FALSE),\"\")","v":""},{"$f":"IFERROR(VLOOKUP(CONCATENATE($C$3,F$7),'N data'!$N$1:$BG$133,$M8,FALSE),\"\")","v":""},{"$f":"IFERROR(VLOOKUP(CONCATENATE($C$3,G$7),'N data'!$N$1:$BG$133,$M8,FALSE),\"\")","v":""},null,null,null,null,"N1",7]
{"$rows_left_out":49}
{"sheet":"2.1 Sammanställning","index":7,"n_rows":6,"n_cols":10,"rows_kept":6,"cut":false,"hidden":false,"merged":[[5,11,5,14],[1,1,1,8],[3,1,3,9]]}
[]
[null,"Sammanställning av identifierade insatser och åtgärder "]
[]
[null,"Information: Nedan listas insatser som har identifierats på de olika ställen där verktyget har använts. Använd pilknapparna för att filtrera ut insatser, ex. inom ett visst tema eller för att sortera om insatserna, ex. utifrån lägst uppskattad resursåtgång eller störst förväntad effekt. Tips! Om en del av en beskrivning av en insats är dold så går det bra att bredda raderna genom att i vänstermarginalen dubbelklicka på strecket mellan raderna."]
[]
[null,"Svarande","Område","Tema","Insats","Aktör","Kontakt","Uppskattad resursåtgång","Förväntad effekt","Priovärde"]